program: Orca
programVersion: 4.2.1
elementType: Cl Cl Cl O O N N N C C C C C C C C C C C C C C C H H H H H H H H H H H H H H H H
charge: 0
multiplicity: 1
keywords: wb97x-d3
keywords: def2-TZVPP
keywords: def2/J RIJCOSX GRIDX6 NOFINALGRIDX
keywords: grid4 nofinalgrid
keywords: scfconv7
keywords: smallprint printgap noloewdin
keywords: NOSOSCF
formula: C15H16Cl3N3O2
InChI: InChI=1S/C15H16Cl3N3O2/c1-2-4-20(15(22)21-5-3-19-10-21)6-7-23-14-12(17)8-11(16)9-13(14)18/h3,5,8-10H,2,4,6-7H2,1H3
39 atoms
Cl 0.303855 -0.579864 -2.353876
Cl 2.699451 -0.939373 2.425077
Cl 5.653273 -0.908532 -2.056042
O  0.429321 -0.756019 0.570872
O  -4.641892 0.584386 -0.194373
N  -2.512957 0.129238 0.455756
N  -3.372876 2.323282 0.522008
N  -2.529962 4.364095 0.504879
C  -2.681016 -1.262776 0.038628
C  -1.48508 0.395876 1.448741
C  -3.436346 -2.127147 1.041597
C  -0.071828 0.532653 0.91626
C  -3.575876 0.94679 0.234283
C  -3.533711 -3.56666 0.556536
C  1.633147 -0.763661 -0.030579
C  -4.354311 3.158963 1.002572
C  -2.302003 3.12129 0.223572
C  1.741436 -0.700189 -1.417611
C  2.807977 -0.858304 0.711005
C  -3.804227 4.400857 1.002121
C  2.970409 -0.748888 -2.053244
C  4.049631 -0.908392 0.100505
C  4.115672 -0.849093 -1.281382
H  -3.201506 -1.270918 -0.918517
H  -1.690554 -1.676706 -0.140039
H  -1.495486 -0.405112 2.194282
H  -1.72459 1.308315 1.991992
H  -4.435826 -1.718804 1.196989
H  -2.930379 -2.107119 2.011441
H  -0.041911 1.193574 0.045676
H  0.553704 0.976103 1.697892
H  -4.064744 -4.190022 1.274947
H  -4.070554 -3.629223 -0.391043
H  -2.546079 -4.00576 0.406623
H  -5.323238 2.793852 1.29353
H  -1.407387 2.738177 -0.239967
H  -4.256444 5.323031 1.329279
H  3.03004 -0.705169 -3.130997
H  4.947812 -0.987547 0.695505
totalener: -2276.63987172 hartree
nucrepener: 2365.93955698 hartree
electener: -4642.57942869 hartree
oneelecener: -7830.08374378 hartree
twoeener: 3187.50431509 hartree
kineticenergy: 2270.86913529 hartree
xcener: -149.624096962181 hartree
chargesum: -0.0000000
charge: -0.046945 -0.049872 -0.055180 -0.329041 -0.373671 -0.152744 -0.063227 -0.296895 -0.069260 -0.136163 -0.091321 -0.025497 0.359413 -0.262642 0.258819 -0.105027 -0.000838 -0.008930 -0.027897 -0.083261 -0.110433 -0.099250 0.041726 0.101484 0.091996 0.120018 0.130887 0.082047 0.052398 0.098736 0.109706 0.087763 0.083872 0.076714 0.158643 0.155966 0.131932 0.123846 0.122124
qa: -0.0469 -0.0499 -0.0552 -0.3290 -0.3737 -0.1527 -0.0632 -0.2969 -0.0693 -0.1362 -0.0913 -0.0255 0.3594 -0.2626 0.2588 -0.1050 -0.0008 -0.0089 -0.0279 -0.0833 -0.1104 -0.0992 0.0417 0.1015 0.0920 0.1200 0.1309 0.0820 0.0524 0.0987 0.1097 0.0878 0.0839 0.0767 0.1586 0.1560 0.1319 0.1238 0.1221
va: 1.2678 1.2648 1.2462 2.0029 2.1311 3.1074 3.2817 3.1349 3.8585 3.9296 3.8662 3.8497 4.2504 3.9563 3.7674 3.9249 4.0531 4.0117 4.0000 4.0380 4.0190 4.0223 3.9534 1.0145 1.0264 1.0147 0.9985 1.0214 1.0134 1.0034 1.0078 1.0050 1.0027 1.0020 1.0078 1.0002 1.0079 1.0165 1.0179
dispcorr: -0.021362872 hartree
energy: -2276.661234589966
dipole: -38.54092 39.34802 0.80711 -2.95493 2.02415 -0.93078 11.54357 -10.92262 0.62095
magnitude: 1.37962 au
magnitude: 3.50672 debye
