program: Gaussian 09
title: 000030016
version: EM64L-G09RevD.01
frameworkgroup: C1[X(C14H21ClN2O2)]
method: RPBEPBE
basis: SDD
operation: Freq
keyword: #p
keyword: freq=noraman
keyword: PBEPBE/SDD
title: #p freq=noraman PBEPBE/SDD
converged: YES YES NO NO
title: Mulliken charges:
elementType: Cl O O N N C C C C C C C C C C C C C C H H H H H H H H H H H H H H H H H H H H H
charge: -0.067071 -0.314776 -0.270403 -0.108722 -0.465620 -0.380789 -0.328644 -0.327495 -0.259675 -0.668484 -0.668815 0.507745 0.263674 0.534677 -0.465298 -0.371410 -0.243944 -0.392249 -0.798259 0.219824 0.210900 0.192256 0.208646 0.207084 0.190358 0.237664 0.233665 0.207619 0.229190 0.208192 0.208376 0.229040 0.207859 0.332253 0.252560 0.303029 0.235219 0.244179 0.243998 0.223649
chargesum: 0.00000
title: Mulliken charges with hydrogens summed into heavy atoms:
elementType: Cl O O N N C C C C C C C C C C C C C C
charge: -0.067071 -0.314776 -0.270403 -0.108722 -0.133367 0.049936 0.072258 0.069947 0.211654 -0.023483 -0.023541 0.507745 0.263674 0.534677 -0.212739 -0.068380 -0.243944 -0.157030 -0.086433
polarizability: 2.90004371e+02 -3.67674731e+00 1.78304326e+02 -5.22708071e+00 1.04104631e+01 1.17031078e+02
1716.lowfreq: -24.9692 -9.7136 -3.8846 -0.0005 0.0006 0.0008 2.4472 12.7572 29.9771
frequency: -18.6699 8.3530 29.9311 48.9320 56.7776 61.9974 73.1033 84.1922 107.2494 117.6555 145.8922 155.6899 168.3276 183.7082 201.0629 206.2739 227.6449 261.7424 279.0188 281.9210 310.4041 335.7234 361.7933 392.7081 414.8257 441.5867 444.1388 452.5680 487.1091 572.2418 578.9631 641.3865 663.9204 699.8647 701.3531 708.9351 747.8057 771.0804 787.6547 794.1310 802.2898 840.9745 860.2040 868.5136 909.9231 915.8893 975.5056 988.1955 996.1547 1014.4586 1027.2440 1046.5730 1060.2119 1065.0329 1075.3743 1084.9239 1093.4754 1122.7741 1156.4703 1159.7711 1172.0302 1207.4955 1216.3735 1232.8543 1259.3961 1275.5980 1285.7628 1290.7611 1292.8986 1326.2059 1357.1188 1361.3560 1366.0051 1385.0965 1386.6298 1388.9741 1400.9772 1405.2463 1459.8272 1461.9637 1462.1426 1465.8037 1470.4058 1473.5873 1479.1080 1485.6228 1486.5818 1490.6885 1491.6592 1516.3249 1580.6988 1626.8432 1663.6684 2855.8189 2864.3934 2907.4122 2982.7215 2982.9585 2984.2662 3020.0545 3023.3101 3036.1146 3046.9838 3061.3625 3074.8312 3077.0695 3092.3848 3092.7127 3093.1654 3093.5028 3137.0838 3146.2810 3192.5466 3544.7725
redmass: 3.8689 4.5637 4.3558 3.7749 7.4292 2.7657 3.6163 2.0480 1.1454 2.7403 2.9940 2.6527 2.2841 2.7170 3.5540 1.6905 2.5888 2.7033 3.4803 2.5212 2.8990 3.9595 3.6594 6.6218 3.6471 3.0542 3.6815 2.8375 2.9716 5.6599 3.7775 1.3722 7.4994 3.1958 4.5361 6.2149 2.9682 3.4705 1.1652 1.1446 1.3264 1.2682 1.6250 6.0397 4.7292 2.2654 1.3191 2.3447 1.4953 6.3600 2.9648 1.5079 1.9388 2.3014 1.9054 2.1827 2.9074 1.7118 1.9911 1.5132 1.6579 2.2629 1.6798 1.6196 2.4290 1.1124 1.2144 1.2440 1.7215 1.3511 3.5744 1.3498 1.3732 1.4652 1.2291 1.2470 1.4335 2.8731 1.0575 1.0538 1.0451 1.2418 1.0557 1.0701 1.0515 1.0788 1.0797 1.1915 1.7239 2.7043 4.5150 7.1235 8.5215 1.0720 1.0714 1.0700 1.0357 1.0369 1.0358 1.0585 1.0863 1.0877 1.0906 1.0973 1.0986 1.0981 1.1007 1.1009 1.0995 1.1083 1.0905 1.0926 1.0946 1.0762
irintensity: 0.0404 0.0200 0.0931 0.8813 4.4885 0.5827 0.0736 0.1550 0.3810 1.3779 0.5019 0.3213 1.2246 4.0891 4.1741 2.5499 1.6445 4.5348 12.6864 3.1076 5.4090 0.3933 2.2525 2.8662 15.2254 6.9906 7.8236 15.0794 3.5387 3.1251 17.5525 38.9981 13.3080 30.1891 21.9665 22.2794 8.9721 1.9139 6.3569 3.6589 8.7604 13.0574 64.1728 65.1141 8.9293 6.7512 3.7178 24.0849 49.6375 193.6304 95.5821 8.0479 48.0219 87.6098 25.8390 2.3377 8.5540 10.6864 410.1289 110.1091 107.7254 26.8041 2.5207 22.6102 12.1979 1.6616 10.4250 27.6748 3.7943 7.4167 127.2730 3.7569 15.0184 3.5215 20.7724 20.3447 38.9948 20.2202 1.9660 11.3504 14.0016 52.9559 1.5877 5.9302 8.8297 15.4700 24.7282 8.2748 7.5907 610.1026 123.9712 118.9409 217.4668 32.9264 165.5866 86.1635 31.8728 29.6240 28.8930 32.0950 12.6200 15.9175 16.5740 15.5740 39.8244 79.8272 29.9433 59.7826 17.1445 24.2559 16.1549 3.5661 4.5790 29.8247
temp: 298.150 k
press: 1.00000 atm
elementType: 17 8 8 7 7 6 6 6 6 6 6 6 6 6 6 6 6 6 6 1 1 1 1 1 1 1 1 1 1 1 1 1 1 1 1 1 1 1 1 1
symmnumber: 1
zpe: 864942.4 jmol-1
zpe.correction: 0.329439 hartree
zpe.thermalcorrener: 0.350122 hartree
zpe.thermalcorrenthalpy: 0.351067 hartree
zpe.thermalcorrgfe: 0.276887 hartree
zpe.sumelectzpe: -1264.639795 hartree
zpe.sumelectthermal: -1264.619112 hartree
zpe.sumelectthermalent: -1264.618168 hartree
zpe.sumelectthermalfe: -1264.692348 hartree
dipole: -2.2647 -1.0743 -0.8738
dipole: 2.6545
quadrupole: -110.5374 -120.1397 -124.0207
quadrupole: 10.9323 5.7231 -0.8315
quadrupole: 7.6952 -1.9071 -5.7881 10.9323 5.7231 -0.8315
hfenergy: -1264.9692343 hartree
pointgroup: C01[X(C14H21Cl1N2O2)]
dipole: -0.9054215 0.3508099 0.3844994 debye
polarizability: 289.6107925|5.66075|174.7489804|7.4357546|18.2651456|120.9800023 unknown
InChI: InChI=1S/C14H21ClN2O2/c1-4-17(5-2)8-9-19-14(18)16-12-7-6-11(3)13(15)10-12/h6-7,10,16H,4-5,8-9H2,1-3H3
charge 0 multiplicity 1
40 atoms
Cl 5.938025 1.948538 0.933915
O  -1.229154 0.537062 0.057301
O  -0.129724 -1.401331 -0.716391
N  -4.949284 0.127837 0.202261
N  1.023676 0.494669 0.125983
C  -3.611997 0.70187 0.486679
C  -5.289933 -1.013705 1.095261
C  -6.026621 1.147537 0.10225
C  -2.543348 -0.065992 -0.301967
C  -6.27386 -2.009357 0.452313
C  -5.970154 1.948732 -1.21226
C  2.385855 0.107553 0.0205
C  -0.095269 -0.244708 -0.229237
C  5.187432 -0.537585 -0.137885
C  3.363882 1.042386 0.451044
C  2.801608 -1.149792 -0.489036
C  4.722572 0.701696 0.362726
C  4.178442 -1.44388 -0.557246
C  6.658208 -0.885385 -0.226951
H  -3.590217 1.760823 0.174487
H  -3.358049 0.681121 1.572436
H  -5.697978 -0.654549 2.073973
H  -4.351192 -1.55024 1.329076
H  -6.994939 0.617257 0.148472
H  -6.00836 1.848502 0.974986
H  -2.703002 0.042233 -1.388761
H  -2.52567 -1.141683 -0.053467
H  -7.240543 -1.534022 0.206075
H  -5.847853 -2.41567 -0.481367
H  -6.480285 -2.847851 1.143386
H  -5.022228 2.508384 -1.313546
H  -6.05569 1.266493 -2.07573
H  -6.796929 2.682277 -1.254284
H  0.822011 1.422816 0.503783
H  3.070857 2.020047 0.848151
H  2.054289 -1.872166 -0.8220
H  4.49002 -2.417582 -0.952703
H  7.20217 -0.172831 -0.874172
H  7.14341 -0.844876 0.765667
H  6.795323 -1.899527 -0.637822
