program: Orca
programVersion: 4.2.1
elementType: Cl Cl Cl O O N N N C C C C C C C C C C C C C C C H H H H H H H H H H H H H H H H
charge: 0
multiplicity: 1
keywords: wb97x-d3
keywords: def2-TZVPP
keywords: def2/J RIJCOSX GRIDX6 NOFINALGRIDX
keywords: grid4 nofinalgrid
keywords: scfconv7
keywords: smallprint printgap noloewdin
keywords: NOSOSCF
formula: C15H16Cl3N3O2
InChI: InChI=1S/C15H16Cl3N3O2/c1-2-4-20(15(22)21-5-3-19-10-21)6-7-23-14-12(17)8-11(16)9-13(14)18/h3,5,8-10H,2,4,6-7H2,1H3
39 atoms
Cl 1.46071 0.037649 1.982795
Cl 1.575638 -2.002549 -2.972379
Cl 6.071302 -1.80983 -0.045399
O  0.33575 -0.808276 -0.609908
O  -1.973781 2.812332 -0.495307
N  -2.514118 0.610907 -0.561708
N  -3.911114 2.178677 0.505788
N  -6.063074 2.353184 0.964002
C  -3.043803 -0.546645 0.158921
C  -1.500517 0.403026 -1.584608
C  -2.261359 -0.970235 1.398113
C  -0.044771 0.455834 -1.158957
C  -2.716704 1.90547 -0.20701
C  -2.176105 0.089678 2.485243
C  1.658211 -1.008118 -0.482464
C  -4.025186 3.119357 1.50221
C  -5.184454 1.768484 0.214943
C  2.337455 -0.675945 0.687023
C  2.3928 -1.583377 -1.517803
C  -5.352367 3.1899 1.781953
C  3.692125 -0.92201 0.835767
C  3.747809 -1.838528 -1.39641
C  4.384972 -1.499799 -0.214467
H  -4.076559 -0.363198 0.445907
H  -3.072073 -1.373701 -0.552373
H  -1.638284 1.166134 -2.351337
H  -1.693725 -0.55914 -2.062571
H  -1.260582 -1.294944 1.119136
H  -2.770477 -1.85393 1.793324
H  0.558556 0.665371 -2.047936
H  0.130036 1.257253 -0.438508
H  -1.678867 -0.313378 3.367363
H  -1.594043 0.955535 2.166453
H  -3.161554 0.441136 2.794498
H  -3.168599 3.627488 1.908609
H  -5.398536 1.072683 -0.581729
H  -5.839628 3.800673 2.524558
H  4.196155 -0.661185 1.755039
H  4.294117 -2.290373 -2.21161
totalener: -2276.63791311 hartree
nucrepener: 2385.00063179 hartree
electener: -4661.63854490 hartree
oneelecener: -7868.53116619 hartree
twoeener: 3206.89262129 hartree
kineticenergy: 2270.86968101 hartree
xcener: -149.625416091250 hartree
chargesum: 0.0000000
charge: -0.053489 -0.053103 -0.058119 -0.329796 -0.369839 -0.146690 -0.023155 -0.298119 -0.100679 -0.064153 -0.089834 -0.055890 0.311162 -0.295015 0.257464 -0.130642 0.013139 0.020235 -0.047437 -0.069940 -0.113566 -0.095593 0.041683 0.109882 0.096104 0.110625 0.097660 0.073029 0.072296 0.105395 0.131641 0.105941 0.068559 0.100963 0.153869 0.150068 0.130760 0.123374 0.121211
qa: -0.0535 -0.0531 -0.0581 -0.3298 -0.3698 -0.1467 -0.0232 -0.2981 -0.1007 -0.0642 -0.0898 -0.0559 0.3112 -0.2950 0.2575 -0.1306 0.0131 0.0202 -0.0474 -0.0699 -0.1136 -0.0956 0.0417 0.1099 0.0961 0.1106 0.0977 0.0730 0.0723 0.1054 0.1316 0.1059 0.0686 0.1010 0.1539 0.1501 0.1308 0.1234 0.1212
va: 1.2618 1.2631 1.2432 1.9831 2.1258 3.1149 3.2465 3.1376 3.9096 3.9152 3.7874 3.8019 4.2616 3.9410 3.7692 3.9252 4.0526 3.9712 4.0129 4.0255 4.0285 4.0132 3.9482 0.9980 1.0079 1.0109 1.0190 1.0400 1.0184 1.0036 1.0148 1.0066 1.0019 1.0034 1.0103 0.9944 1.0074 1.0166 1.0183
dispcorr: -0.023714099 hartree
energy: -2276.661627212813
dipole: -36.82017 37.72792 0.90775 9.21704 -10.24294 -1.02590 8.64948 -8.88073 -0.23125
magnitude: 1.38923 au
magnitude: 3.53114 debye
