program: Orca
programVersion: 4.2.1
elementType: Cl Cl Cl O O N N N C C C C C C C C C C C C C C C H H H H H H H H H H H H H H H H
charge: 0
multiplicity: 1
keywords: wb97x-d3
keywords: def2-TZVPP
keywords: def2/J RIJCOSX GRIDX6 NOFINALGRIDX
keywords: grid4 nofinalgrid
keywords: scfconv7
keywords: smallprint printgap noloewdin
keywords: NOSOSCF
formula: C15H16Cl3N3O2
InChI: InChI=1S/C15H16Cl3N3O2/c1-2-4-20(15(22)21-5-3-19-10-21)6-7-23-14-12(17)8-11(16)9-13(14)18/h3,5,8-10H,2,4,6-7H2,1H3
39 atoms
Cl 0.562257 1.533371 -0.121688
Cl 1.923274 -3.436772 -1.615563
Cl 5.631497 0.440077 -1.48776
O  0.101501 -1.310368 -0.723355
O  -1.395889 -0.065065 2.768402
N  -2.318028 -0.418495 0.73268
N  -2.6174 1.627019 1.891404
N  -2.672471 3.764973 2.43631
C  -2.760796 0.103286 -0.560625
C  -1.741951 -1.755078 0.744055
C  -3.923032 -0.671629 -1.175068
C  -0.236814 -1.807434 0.574007
C  -2.064187 0.321585 1.839126
C  -5.18555 -0.727746 -0.329999
C  1.376545 -0.915741 -0.877691
C  -3.89817 2.066142 1.635052
C  -1.93623 2.700036 2.393407
C  1.754478 0.403945 -0.637137
C  2.361865 -1.80342 -1.304001
C  -3.901562 3.381376 1.977283
C  3.057042 0.834307 -0.824055
C  3.671407 -1.399234 -1.50013
C  4.005862 -0.078806 -1.25167
H  -3.035752 1.148788 -0.44754
H  -1.917894 0.084693 -1.252203
H  -2.216379 -2.338163 -0.04462
H  -1.985409 -2.248583 1.685743
H  -3.605502 -1.68687 -1.425029
H  -4.142065 -0.199284 -2.13569
H  0.259087 -1.224295 1.351331
H  0.091036 -2.847824 0.670101
H  -5.930634 -1.377536 -0.788016
H  -4.9874 -1.114862 0.670391
H  -5.644607 0.256237 -0.227391
H  -4.676553 1.413395 1.284623
H  -0.903394 2.625441 2.695238
H  -4.728004 4.072181 1.927303
H  3.324143 1.863856 -0.634772
H  4.416371 -2.106071 -1.835677
totalener: -2276.63939590 hartree
nucrepener: 2429.11845266 hartree
electener: -4705.75784857 hartree
oneelecener: -7956.79871905 hartree
twoeener: 3251.04087048 hartree
kineticenergy: 2270.87408197 hartree
xcener: -149.630242592706 hartree
chargesum: 0.0000000
charge: -0.054261 -0.052850 -0.057490 -0.337334 -0.381911 -0.132221 -0.024472 -0.302466 -0.137956 -0.068688 -0.092186 -0.056617 0.301626 -0.283971 0.226853 -0.186524 0.055924 0.029091 -0.013798 -0.078331 -0.113166 -0.101028 0.043379 0.128832 0.110926 0.108892 0.111101 0.068804 0.075357 0.131191 0.104232 0.102233 0.088671 0.078748 0.186730 0.146103 0.130740 0.125808 0.120029
qa: -0.0543 -0.0528 -0.0575 -0.3373 -0.3819 -0.1322 -0.0245 -0.3025 -0.1380 -0.0687 -0.0922 -0.0566 0.3016 -0.2840 0.2269 -0.1865 0.0559 0.0291 -0.0138 -0.0783 -0.1132 -0.1010 0.0434 0.1288 0.1109 0.1089 0.1111 0.0688 0.0754 0.1312 0.1042 0.1022 0.0887 0.0787 0.1867 0.1461 0.1307 0.1258 0.1200
va: 1.2690 1.2627 1.2438 1.9923 2.1128 3.0654 3.2394 3.1489 3.8755 3.9255 3.8588 3.8460 4.2735 3.9315 3.8214 3.8912 4.0321 3.9754 3.9843 4.0782 4.0260 4.0261 3.9545 0.9870 1.0265 1.0030 1.0122 1.0053 1.0138 1.0023 1.0112 1.0087 1.0052 1.0017 0.9922 1.0130 1.0097 1.0161 1.0191
dispcorr: -0.023582274 hartree
energy: -2276.662978178615
dipole: -44.76578 44.28263 -0.48315 -1.47730 0.10600 -1.37131 5.81139 -7.07432 -1.26293
magnitude: 1.92585 au
magnitude: 4.89512 debye
