program: Orca
programVersion: 4.2.1
elementType: Cl Cl Cl O O N N N C C C C C C C C C C C C C C C H H H H H H H H H H H H H H H H
charge: 0
multiplicity: 1
keywords: wb97x-d3
keywords: def2-TZVPP
keywords: def2/J RIJCOSX GRIDX6 NOFINALGRIDX
keywords: grid4 nofinalgrid
keywords: scfconv7
keywords: smallprint printgap noloewdin
keywords: NOSOSCF
formula: C15H16Cl3N3O2
InChI: InChI=1S/C15H16Cl3N3O2/c1-2-4-20(15(22)21-5-3-19-10-21)6-7-23-14-12(17)8-11(16)9-13(14)18/h3,5,8-10H,2,4,6-7H2,1H3
39 atoms
Cl 0.851199 0.107927 1.768559
Cl 1.4544 -1.629996 -3.261505
Cl 5.741016 -0.048573 -0.443976
O  -0.024083 -0.964352 -0.813514
O  -2.341918 0.54675 2.599871
N  -2.518127 -0.325948 0.508649
N  -2.554739 1.994883 0.857547
N  -2.074964 4.133373 0.613053
C  -2.547943 -1.687137 1.037907
C  -2.265285 -0.15832 -0.912427
C  -3.967288 -2.17733 1.287558
C  -0.817227 0.135742 -1.245888
C  -2.462833 0.682494 1.40937
C  -3.982711 -3.603057 1.818621
C  1.298784 -0.732494 -0.738217
C  -3.53314 2.52615 0.048052
C  -1.71899 3.022915 1.181122
C  1.872442 -0.228043 0.426787
C  2.140493 -1.006548 -1.812709
C  -3.212797 3.84187 -0.083788
C  3.236564 -0.016345 0.53156
C  3.508352 -0.807424 -1.733201
C  4.041465 -0.307026 -0.557175
H  -2.043709 -2.337684 0.32346
H  -1.964726 -1.729467 1.957349
H  -2.87154 0.635574 -1.345618
H  -2.57737 -1.077539 -1.409232
H  -4.542181 -2.119652 0.358419
H  -4.458073 -1.510771 2.00028
H  -0.717221 0.276209 -2.327588
H  -0.494671 1.061368 -0.759084
H  -5.000907 -3.947917 1.995695
H  -3.518195 -4.297403 1.116221
H  -3.441533 -3.678427 2.762779
H  -4.37206 1.95102 -0.304724
H  -0.862198 2.878501 1.82065
H  -3.747306 4.597419 -0.637112
H  3.660085 0.371667 1.446576
H  4.143009 -1.032996 -2.577834
totalener: -2276.63909874 hartree
nucrepener: 2429.14711181 hartree
electener: -4705.78621055 hartree
oneelecener: -7956.82974447 hartree
twoeener: 3251.04353392 hartree
kineticenergy: 2270.87861465 hartree
xcener: -149.625603360691 hartree
chargesum: -0.0000000
charge: -0.034542 -0.052872 -0.057152 -0.326626 -0.348207 -0.098541 -0.022977 -0.299324 -0.076856 -0.095644 -0.065672 -0.050092 0.236432 -0.261219 0.236316 -0.151922 0.048935 0.007494 -0.016883 -0.084918 -0.110215 -0.104668 0.048372 0.092616 0.097750 0.111846 0.105643 0.049382 0.074626 0.109728 0.116353 0.088266 0.073300 0.084822 0.161575 0.138898 0.130099 0.125303 0.120573
qa: -0.0345 -0.0529 -0.0572 -0.3266 -0.3482 -0.0985 -0.0230 -0.2993 -0.0769 -0.0956 -0.0657 -0.0501 0.2364 -0.2612 0.2363 -0.1519 0.0489 0.0075 -0.0169 -0.0849 -0.1102 -0.1047 0.0484 0.0926 0.0977 0.1118 0.1056 0.0494 0.0746 0.1097 0.1164 0.0883 0.0733 0.0848 0.1616 0.1389 0.1301 0.1253 0.1206
va: 1.2917 1.2623 1.2442 2.0065 2.1427 3.0732 3.2227 3.1357 3.8524 3.9323 3.8692 3.8587 4.3653 3.9569 3.8048 3.9052 4.0396 4.0013 3.9882 4.0706 4.0178 4.0266 3.9463 1.0092 1.0273 1.0067 1.0057 1.0124 1.0148 1.0142 0.9943 1.0052 1.0030 1.0025 0.9941 1.0150 1.0091 1.0170 1.0187
dispcorr: -0.022884806 hartree
energy: -2276.661983545682
dipole: -42.04191 41.66089 -0.38102 -7.28913 6.02418 -1.26494 6.78440 -8.06528 -1.28088
magnitude: 1.84008 au
magnitude: 4.67712 debye
