program: Gaussian 09
title: 000030053
version: EM64L-G09RevD.01
frameworkgroup: C1[X(C14H18Br2N2O2)]
method: RPBEPBE
basis: SDD
operation: Freq
keyword: #p
keyword: freq=noraman
keyword: PBEPBE/SDD
title: #p freq=noraman PBEPBE/SDD
converged: YES YES NO NO
title: Mulliken charges:
elementType: Br Br O O N N C C C C C C C C C C C C C C H H H H H H H H H H H H H H H H H H
charge: 0.025439 0.041022 -0.304883 -0.232933 -0.081726 -0.482747 -0.371298 -0.364379 -0.385306 -0.391101 -0.399387 -0.357793 -0.259470 0.282685 0.642308 -0.369888 -0.329531 -0.195415 -0.196073 -0.231291 0.212688 0.168606 0.175598 0.209001 0.205568 0.192478 0.192743 0.207825 0.189047 0.215424 0.201627 0.217860 0.241639 0.233197 0.342671 0.256397 0.254864 0.244535
chargesum: 0.00000
title: Mulliken charges with hydrogens summed into heavy atoms:
elementType: Br Br O O N N C C C C C C C C C C C C C C
charge: 0.025439 0.041022 -0.304883 -0.232933 -0.081726 -0.140076 0.009996 0.020220 0.012739 0.009468 0.005084 0.061694 0.215366 0.282685 0.642308 -0.369888 -0.329531 0.060982 0.058791 0.013244
polarizability: 2.64271033e+02 -3.64059631e+00 2.28182155e+02 1.44715224e+01 4.18716760e+00 1.23252638e+02
1716.lowfreq: -9.7554 -4.7891 -0.0009 -0.0008 -0.0006 5.0669 6.6758 12.4598 29.9812
frequency: -7.3711 12.3609 29.9338 45.4572 46.5321 65.6970 78.9995 103.5007 111.1395 140.4844 147.2839 176.3407 177.6294 228.9092 240.5007 252.0871 260.7730 290.6100 313.7026 313.9371 356.9297 377.9105 412.9797 447.7266 467.5944 470.4139 506.7720 520.5523 552.5807 560.0858 618.9999 677.5639 689.3172 711.0886 732.5209 764.3142 774.0814 793.0552 805.5436 840.9640 853.0410 854.7382 899.3793 904.8311 920.5166 958.2660 971.9408 992.0083 999.2636 1038.0254 1045.3865 1049.6375 1071.0605 1089.4361 1101.2368 1113.9160 1125.7726 1149.8239 1150.3534 1159.4473 1161.8988 1178.5732 1197.9421 1245.4672 1258.1016 1265.3307 1267.9958 1284.0016 1293.3192 1317.8726 1331.3442 1340.1344 1344.9311 1347.8649 1354.1255 1370.4303 1396.3712 1408.2706 1439.2536 1450.3104 1457.8650 1461.7179 1465.4538 1470.4135 1475.6510 1480.7603 1485.5660 1555.7787 1581.8457 1675.8092 2822.1774 2832.0952 2894.3658 2966.3772 2985.1005 2987.6615 3020.0640 3024.8119 3030.2754 3036.2009 3040.4438 3046.7498 3056.0905 3093.8921 3152.6297 3171.7437 3183.6320 3534.9922
redmass: 3.2616 6.1559 4.7399 5.5807 7.0106 8.0560 4.0788 6.1705 4.7447 3.5183 8.0407 4.8339 4.8894 2.0598 3.9095 4.0363 8.0338 5.2313 3.5618 3.9103 3.3878 2.0814 3.2751 2.8761 3.7263 3.5337 5.2324 2.2569 1.9211 1.8644 6.6019 5.4997 8.9583 7.9206 4.4103 3.1240 1.4620 1.2811 1.3869 5.0372 1.7302 2.2097 1.3562 2.3441 7.6213 1.3044 1.3416 3.4868 4.4463 6.5960 2.1003 1.9183 2.0490 2.9116 1.6112 2.0639 2.0464 1.3192 1.5853 2.4961 2.5080 1.2010 1.4313 1.6591 1.2460 1.1811 2.0715 1.2273 1.3864 1.3545 1.3069 1.4222 3.3306 1.8525 1.4755 1.4159 1.4740 2.1602 2.4586 1.0912 1.0879 1.0862 1.0875 1.1810 1.2373 1.4642 1.2487 6.1829 8.0640 9.3222 1.0715 1.0699 1.0697 1.0627 1.0613 1.0614 1.0595 1.0876 1.0896 1.0927 1.0891 1.1034 1.1036 1.1088 1.0872 1.0929 1.0997 1.0760
irintensity: 0.2381 0.0702 0.5347 0.4329 0.8139 3.6427 0.1695 0.0865 2.1656 2.6725 1.9235 0.2610 1.6277 3.1402 0.9941 7.2146 3.9940 2.6373 10.5365 7.3202 11.1099 3.9063 10.8166 0.4236 1.5112 8.6789 2.2775 27.0735 46.1413 23.1355 0.2399 16.9680 35.5986 98.6647 13.9271 11.4738 51.3399 1.0377 0.0955 3.4077 3.1033 10.3948 0.1582 0.8735 16.5657 2.7215 0.9043 16.0377 159.6692 59.2949 50.8912 20.3876 12.5442 24.7054 30.5183 23.4610 5.9130 10.1168 30.8454 368.1156 183.3118 4.0271 50.5457 8.4572 1.8700 4.5903 3.9405 10.3644 8.8539 10.9382 1.1412 0.4987 20.3940 16.9167 2.3875 4.0246 6.7131 79.0368 10.5195 7.2560 14.3308 3.3774 11.8596 112.4234 124.9044 198.0001 111.1666 45.8363 9.2138 206.0356 43.4888 154.4809 91.1720 39.6208 33.3977 31.5880 25.6309 50.9023 59.3056 29.4398 25.6016 19.0692 96.9651 29.4333 2.4070 1.4212 7.9955 42.6585
temp: 298.150 k
press: 1.00000 atm
elementType: 35 35 8 8 7 7 6 6 6 6 6 6 6 6 6 6 6 6 6 6 1 1 1 1 1 1 1 1 1 1 1 1 1 1 1 1 1 1
symmnumber: 1
zpe: 788390.8 jmol-1
zpe.correction: 0.300282 hartree
zpe.thermalcorrener: 0.319865 hartree
zpe.thermalcorrenthalpy: 0.320810 hartree
zpe.thermalcorrgfe: 0.248191 hartree
zpe.sumelectzpe: -829.639261 hartree
zpe.sumelectthermal: -829.619678 hartree
zpe.sumelectthermalent: -829.618734 hartree
zpe.sumelectthermalfe: -829.691352 hartree
dipole: 0.2261 -0.9180 -1.9045
dipole: 2.1262
quadrupole: -104.3374 -135.0901 -142.9843
quadrupole: 1.9393 5.3843 -0.1150
quadrupole: 23.1332 -7.6195 -15.5137 1.9393 5.3843 -0.1150
hfenergy: -829.9395432 hartree
pointgroup: C01 [X(C14H18Br2N2O2)]
dipole: 0.0670281 -0.4098293 -0.7261633 debye
polarizability: 264.3615782|-3.9617844|228.5189828|12.9763253|-2.8047668|122.8252658 unknown
InChI: InChI=1S/C14H18Br2N2O2/c15-11-5-4-6-12(16)13(11)17-14(19)20-10-9-18-7-2-1-3-8-18/h4-6,17H,1-3,7-10H2
charge 0 multiplicity 1
38 atoms
Br 3.516636 -3.031356 -0.125597
Br 2.717301 2.743709 -0.699747
O  -0.338132 -0.419318 -0.466725
O  0.860824 0.747009 1.195487
N  -4.053876 -0.297568 -0.059586
N  1.917189 -0.371929 -0.60548
C  -5.104109 -1.316326 -0.31459
C  -4.511952 1.063075 -0.4427
C  -6.385527 -0.992174 0.480285
C  -5.775123 1.464804 0.345452
C  -6.900477 0.425186 0.137977
C  -2.738138 -0.647847 -0.642646
C  -1.610596 -0.085017 0.2321
C  0.82628 0.061446 0.150652
C  3.267921 -0.112615 -0.26242
C  4.17219 -1.184376 -0.00892
C  3.804608 1.205377 -0.192558
C  5.521356 -0.97435 0.329513
C  5.143731 1.440718 0.180593
C  5.999587 0.349689 0.441776
H  -4.71123 -2.304728 -0.011661
H  -5.358052 -1.376301 -1.406678
H  -4.733819 1.111268 -1.542645
H  -3.698916 1.784781 -0.243244
H  -6.154818 -1.050463 1.561586
H  -7.158191 -1.75352 0.258661
H  -6.107032 2.469823 0.020772
H  -5.518966 1.525682 1.420568
H  -7.232558 0.449859 -0.921041
H  -7.781379 0.677779 0.757916
H  -2.615822 -0.276722 -1.688782
H  -2.640469 -1.748253 -0.676846
H  -1.61294 -0.547811 1.233737
H  -1.671417 1.011117 0.351377
H  1.714751 -1.075616 -1.319479
H  6.179818 -1.826259 0.517856
H  5.517052 2.466503 0.240805
H  7.041796 0.530022 0.722231
