program: Orca
programVersion: 4.2.1
elementType: Cl Cl Cl O O N N N C C C C C C C C C C C C C C C H H H H H H H H H H H H H H H H
charge: 0
multiplicity: 1
keywords: wb97x-d3
keywords: def2-TZVPP
keywords: def2/J RIJCOSX GRIDX6 NOFINALGRIDX
keywords: grid4 nofinalgrid
keywords: scfconv7
keywords: smallprint printgap noloewdin
keywords: NOSOSCF
formula: C15H16Cl3N3O2
InChI: InChI=1S/C15H16Cl3N3O2/c1-2-4-20(15(22)21-5-3-19-10-21)6-7-23-14-12(17)8-11(16)9-13(14)18/h3,5,8-10H,2,4,6-7H2,1H3
39 atoms
Cl 2.271259 -1.254981 2.103132
Cl 0.407028 -1.691651 -2.927637
Cl 3.032226 2.724679 -1.389113
O  0.804859 -2.560639 -0.196015
O  -1.702989 -0.692275 2.425519
N  -1.706843 -0.787475 0.150332
N  -1.495124 1.25636 1.284969
N  -1.55394 3.341647 2.002798
C  -2.444061 -0.249421 -0.994184
C  -1.610391 -2.240693 0.205029
C  -3.914784 -0.656953 -1.019989
C  -0.277056 -2.762986 0.710598
C  -1.658819 -0.143779 1.351507
C  -4.703041 -0.185889 0.193288
C  1.290405 -1.330642 -0.4144
C  -0.7754 2.005473 0.376247
C  -1.922401 2.12617 2.251117
C  1.991899 -0.591679 0.540469
C  1.196622 -0.782775 -1.695847
C  -0.829644 3.279236 0.841303
C  2.525775 0.654132 0.251378
C  1.739501 0.449724 -2.014709
C  2.389735 1.167923 -1.024981
H  -2.381376 0.836251 -0.99061
H  -1.944868 -0.5868 -1.903189
H  -1.774429 -2.616097 -0.805248
H  -2.39392 -2.669107 0.839341
H  -4.009088 -1.740984 -1.128393
H  -4.34666 -0.231646 -1.929778
H  -0.050853 -2.372168 1.700858
H  -0.354327 -3.846361 0.801209
H  -4.373097 -0.670993 1.112582
H  -4.61311 0.892742 0.334579
H  -5.762764 -0.412065 0.078626
H  -0.276397 1.569212 -0.470964
H  -2.50314 1.794875 3.097208
H  -0.374676 4.156364 0.409651
H  3.047391 1.20835 1.018104
H  1.650075 0.841643 -3.017687
totalener: -2276.63702421 hartree
nucrepener: 2573.57863745 hartree
electener: -4850.21566166 hartree
oneelecener: -8245.58648956 hartree
twoeener: 3395.37082789 hartree
kineticenergy: 2270.87017772 hartree
xcener: -149.632336367721 hartree
chargesum: -0.0000000
charge: -0.046689 -0.061617 -0.057449 -0.306532 -0.356917 -0.078544 0.033152 -0.293799 -0.130902 -0.125140 -0.106331 -0.023871 0.195176 -0.251928 0.253007 -0.189906 0.052758 0.017883 -0.064546 -0.079737 -0.077249 -0.071326 -0.007781 0.119708 0.105691 0.107858 0.112594 0.064906 0.077611 0.128558 0.103684 0.080762 0.086276 0.098921 0.174814 0.146452 0.132678 0.118274 0.119502
qa: -0.0467 -0.0616 -0.0574 -0.3065 -0.3569 -0.0785 0.0332 -0.2938 -0.1309 -0.1251 -0.1063 -0.0239 0.1952 -0.2519 0.2530 -0.1899 0.0528 0.0179 -0.0645 -0.0797 -0.0772 -0.0713 -0.0078 0.1197 0.1057 0.1079 0.1126 0.0649 0.0776 0.1286 0.1037 0.0808 0.0863 0.0989 0.1748 0.1465 0.1327 0.1183 0.1195
va: 1.2651 1.2528 1.2429 2.0739 2.1305 2.9344 3.1789 3.1433 3.8750 3.8757 3.8710 3.8712 4.3113 3.9211 3.8369 3.9012 4.0436 3.9040 3.9011 4.1055 3.9480 3.9447 3.9424 0.9986 1.0266 1.0017 1.0109 1.0090 1.0122 1.0126 1.0064 1.0116 1.0061 1.0059 0.9933 1.0094 1.0122 1.0227 1.0240
dispcorr: -0.027985299 hartree
energy: -2276.665009511858
dipole: -36.47744 35.86082 -0.61662 -3.29268 2.32424 -0.96844 2.24658 -3.51499 -1.26841
magnitude: 1.71083 au
magnitude: 4.34860 debye
