program: Gaussian 09
title: 000030010
version: EM64L-G09RevD.01
frameworkgroup: C1[X(C15H21ClN2O2)]
method: RPBEPBE
basis: SDD
operation: Freq
keyword: #p
keyword: freq=noraman
keyword: PBEPBE/SDD
title: #p freq=noraman PBEPBE/SDD
converged: YES YES NO NO
title: Mulliken charges:
elementType: Cl O O N N C C C C C C C C C C C C C C C H H H H H H H H H H H H H H H H H H H H H
charge: -0.078341 -0.316028 -0.264731 -0.081984 -0.474037 -0.364965 -0.371510 -0.391552 -0.386056 -0.398930 -0.356121 -0.264379 0.259414 0.346708 0.316114 -0.369621 -0.253718 -0.822737 -0.214736 -0.262575 0.175811 0.208365 0.213051 0.168997 0.193476 0.207875 0.205797 0.193405 0.216193 0.189181 0.199427 0.218624 0.241413 0.232234 0.356141 0.304460 0.234857 0.264240 0.235281 0.233710 0.257250
chargesum: 0.00000
title: Mulliken charges with hydrogens summed into heavy atoms:
elementType: Cl O O N N C C C C C C C C C C C C C C C
charge: -0.078341 -0.316028 -0.264731 -0.081984 -0.117896 0.019210 0.010539 0.009799 0.013146 0.006444 0.061929 0.209268 0.259414 0.346708 0.316114 -0.065161 -0.253718 -0.088360 0.018974 -0.005325
polarizability: 2.92356267e+02 3.80765279e+00 1.86809157e+02 -4.94950433e+00 -3.13648453e+00 1.19103133e+02
1716.lowfreq: -27.6438 -4.1814 -0.0012 -0.0011 -0.0003 2.5074 7.7163 16.0725 27.4513
frequency: -21.9979 15.9943 27.4218 52.3195 55.5409 70.8899 97.7555 118.6555 147.8123 159.0034 165.5708 181.7278 217.1447 220.9612 235.4860 268.3701 294.6825 298.8794 312.5166 344.3580 370.9039 377.4488 406.3535 449.3029 460.7760 479.1518 501.2744 544.8057 561.9480 564.0488 638.2038 643.0398 702.3662 716.3632 717.5619 763.0489 789.2846 790.9543 795.2824 803.3623 841.7825 849.0676 854.2767 904.0640 908.6356 917.7301 955.3382 984.7723 992.1081 996.1003 1018.6193 1039.6755 1045.1543 1049.6698 1074.1445 1088.9380 1100.9188 1114.6611 1125.8530 1138.8307 1150.0503 1159.4426 1163.2825 1179.0300 1198.4939 1215.9980 1245.6375 1259.5582 1265.2817 1285.3747 1293.1735 1294.5491 1318.7475 1330.4922 1339.5559 1346.7635 1353.6969 1364.7927 1371.3806 1397.6925 1400.4633 1434.8853 1443.9976 1449.2953 1458.2127 1459.8976 1463.7080 1471.0524 1476.2376 1478.2136 1484.8589 1489.9776 1521.4278 1580.7083 1614.3841 1666.7387 2821.3466 2831.0707 2892.2858 2962.8278 2966.3445 2986.4842 2987.2731 3020.2748 3024.9712 3030.2500 3033.1396 3037.1039 3040.7387 3047.5500 3056.2879 3094.2403 3113.6404 3148.2981 3179.1103 3192.9670 3555.0387
redmass: 3.0926 5.3362 4.7881 4.6966 7.8013 4.2988 3.6646 2.5491 3.0239 4.4273 4.0139 1.3025 3.8943 2.4709 2.7397 4.3057 4.0679 4.7088 2.4339 4.2225 2.7089 3.3792 3.1080 2.8743 3.0996 4.0929 3.4647 3.3198 4.2110 2.5050 6.8069 1.3511 5.8211 6.4129 2.6340 3.5182 1.4843 1.8513 2.3577 1.3622 4.0057 1.5492 2.5973 2.3778 1.3563 6.6700 1.3106 1.3113 2.2392 2.1859 4.8202 1.4823 1.9886 1.9250 2.1277 2.8516 1.6337 2.0123 2.0687 2.2381 1.3254 2.3707 2.4010 1.2010 1.5965 1.8664 1.6493 1.2470 1.1790 1.2287 1.4056 2.1934 1.3404 1.3109 1.4171 1.5028 1.4637 3.2781 1.6161 1.4213 1.3112 2.2727 2.5202 1.0909 1.0873 1.0866 1.0876 1.0944 1.2435 1.1489 1.0864 1.0440 2.1065 4.9952 6.3894 8.0605 1.0715 1.0700 1.0698 1.0411 1.0629 1.0619 1.0606 1.0603 1.0872 1.0883 1.0983 1.0935 1.0888 1.1033 1.1037 1.1087 1.0931 1.0885 1.0949 1.0961 1.0754
irintensity: 0.0634 0.0308 0.0228 0.2003 3.9349 0.3581 0.4751 1.7182 1.6262 0.9737 3.6444 0.4521 0.5598 3.2731 0.7190 5.3896 8.6819 6.2878 8.1991 1.8045 20.6802 1.8823 16.6608 0.3643 1.6359 1.1909 0.0067 0.4454 1.7602 1.0122 14.0026 51.8639 51.9520 25.7098 0.0964 9.4028 70.5749 1.3621 0.0973 0.1511 48.5955 1.3205 8.0426 1.4219 3.1783 10.6920 2.7826 3.5273 94.9517 187.6820 72.0021 3.6010 37.5061 20.3636 23.8015 24.0060 34.7227 24.6863 5.2977 183.0940 6.0012 190.6670 303.1428 4.6557 10.1272 9.5352 8.2383 1.8145 4.3690 11.3236 12.3785 24.2216 14.5976 0.9728 0.3165 0.4555 4.7021 48.1406 24.7699 5.5258 13.1184 64.2697 106.3886 7.2405 13.8703 6.5798 7.9502 17.6977 112.0524 19.4299 17.8501 15.1578 383.1056 262.7676 34.5713 210.3250 45.1388 149.8577 90.5395 24.8776 39.8955 29.1997 34.0420 28.3491 54.3225 53.7332 18.3440 36.7129 26.1830 19.7696 95.1569 32.6163 4.2406 9.3179 3.0118 7.8606 36.9888
temp: 298.150 k
press: 1.00000 atm
elementType: 17 8 8 7 7 6 6 6 6 6 6 6 6 6 6 6 6 6 6 6 1 1 1 1 1 1 1 1 1 1 1 1 1 1 1 1 1 1 1 1 1
symmnumber: 1
zpe: 890076.7 jmol-1
zpe.correction: 0.339012 hartree
zpe.thermalcorrener: 0.358302 hartree
zpe.thermalcorrenthalpy: 0.359247 hartree
zpe.thermalcorrgfe: 0.289242 hartree
zpe.sumelectzpe: -1302.692715 hartree
zpe.sumelectthermal: -1302.673425 hartree
zpe.sumelectthermalent: -1302.672481 hartree
zpe.sumelectthermalfe: -1302.742485 hartree
dipole: 3.0287 -2.1135 0.4912
dipole: 3.7257
quadrupole: -125.7496 -124.5019 -128.2459
quadrupole: -6.9716 2.3723 1.2432
quadrupole: 0.4162 1.6639 -2.0801 -6.9716 2.3723 1.2432
hfenergy: -1303.0317273 hartree
pointgroup: C01 [X(C15H21Cl1N2O2)]
dipole: -1.2171006 0.7512666 0.3207569 debye
polarizability: 292.0308009|6.4223772|184.4066788|5.4040021|13.8120826|121.8310765 unknown
InChI: InChI=1S/C15H21ClN2O2/c1-12-13(16)6-5-7-14(12)17-15(19)20-11-10-18-8-3-2-4-9-18/h5-7,17H,2-4,8-11H2,1H3
charge 0 multiplicity 1
41 atoms
Cl 6.779949 1.540973 0.508362
O  -0.529878 0.364892 -0.09315
O  0.487171 -1.697134 -0.602068
N  -4.268088 0.263425 -0.105716
N  1.720341 0.258812 -0.039943
C  -4.705847 -0.462741 1.115052
C  -5.274751 1.269365 -0.532337
C  -6.047603 -1.185276 0.880604
C  -6.633147 0.599247 -0.821686
C  -7.131035 -0.186647 0.412904
C  -2.90096 0.819851 0.017685
C  -1.863054 -0.257509 -0.322018
C  0.574284 -0.487629 -0.27936
C  3.07262 -0.171753 -0.105585
C  4.078308 0.80499 0.202909
C  3.418655 -1.500818 -0.459874
C  5.418857 0.366052 0.132051
C  3.685218 2.220873 0.580009
C  4.77608 -1.87397 -0.5119
C  5.796338 -0.944976 -0.216567
H  -4.815575 0.246358 1.979207
H  -3.927791 -1.196887 1.394104
H  -4.899262 1.771469 -1.443373
H  -5.418011 2.060674 0.251445
H  -6.35975 -1.691001 1.814563
H  -5.902215 -1.965153 0.108477
H  -6.511246 -0.093084 -1.677026
H  -7.368662 1.37245 -1.116229
H  -8.073311 -0.717671 0.180466
H  -7.354821 0.52465 1.235323
H  -2.691831 1.228287 1.035995
H  -2.786512 1.656247 -0.695682
H  -1.944869 -0.573177 -1.376047
H  -1.954503 -1.151784 0.319273
H  1.542675 1.23245 0.212038
H  2.627355 -2.217259 -0.686996
H  3.050264 2.239714 1.488085
H  4.573147 2.834127 0.792301
H  3.130895 2.72197 -0.238487
H  5.043736 -2.899696 -0.785738
H  6.851834 -1.225413 -0.25447
