program: Orca
programVersion: 4.2.1
elementType: Cl Cl Cl O O N N N C C C C C C C C C C C C C C C H H H H H H H H H H H H H H H H
charge: 0
multiplicity: 1
keywords: wb97x-d3
keywords: def2-TZVPP
keywords: def2/J RIJCOSX GRIDX6 NOFINALGRIDX
keywords: grid4 nofinalgrid
keywords: scfconv7
keywords: smallprint printgap noloewdin
keywords: NOSOSCF
formula: C15H16Cl3N3O2
InChI: InChI=1S/C15H16Cl3N3O2/c1-2-4-20(15(22)21-5-3-19-10-21)6-7-23-14-12(17)8-11(16)9-13(14)18/h3,5,8-10H,2,4,6-7H2,1H3
39 atoms
Cl 0.490794 1.486007 0.055141
Cl 2.00158 -3.345897 -1.720474
Cl 5.576715 0.645564 -1.420574
O  0.119671 -1.335372 -0.698119
O  -1.378637 -0.260123 2.858953
N  -2.274597 -0.546626 0.803162
N  -2.617317 1.4471 2.026657
N  -4.073266 3.106582 2.069818
C  -2.780525 -0.009737 -0.454903
C  -1.700027 -1.881346 0.7587
C  -4.146996 -0.557192 -0.848753
C  -0.196412 -1.909063 0.572512
C  -2.043195 0.152581 1.938372
C  -4.624511 0.044811 -2.161623
C  1.378482 -0.88896 -0.841259
C  -1.99903 2.498395 2.665411
C  -3.876199 1.879571 1.707452
C  1.713872 0.428234 -0.532999
C  2.388207 -1.717647 -1.325491
C  -2.90566 3.509005 2.659877
C  2.998754 0.912819 -0.709307
C  3.68054 -1.257838 -1.513588
C  3.972838 0.058055 -1.196516
H  -2.810281 1.077263 -0.402075
H  -2.057654 -0.244804 -1.237586
H  -2.180825 -2.427929 -0.053762
H  -1.933332 -2.417271 1.679496
H  -4.877216 -0.35964 -0.059814
H  -4.098834 -1.64584 -0.941642
H  0.298211 -1.361333 1.376621
H  0.147515 -2.948403 0.607889
H  -4.729711 1.128156 -2.087407
H  -3.924665 -0.16318 -2.972253
H  -5.592932 -0.359964 -2.452122
H  -0.996695 2.422118 3.047718
H  -4.610014 1.240392 1.243866
H  -2.786024 4.506685 3.049946
H  3.232846 1.939207 -0.466498
H  4.444762 -1.91892 -1.895782
totalener: -2276.64204785 hartree
nucrepener: 2425.42297579 hartree
electener: -4702.06502364 hartree
oneelecener: -7949.39308805 hartree
twoeener: 3247.32806441 hartree
kineticenergy: 2270.87464589 hartree
xcener: -149.629320497570 hartree
chargesum: 0.0000000
charge: -0.052388 -0.052330 -0.057826 -0.338377 -0.386573 -0.118240 -0.035512 -0.299147 -0.161083 -0.058505 -0.083608 -0.052099 0.307170 -0.249758 0.223524 -0.117563 0.008922 0.030398 -0.014904 -0.082997 -0.109591 -0.100293 0.042542 0.120550 0.120419 0.100630 0.109206 0.061368 0.062507 0.129807 0.104658 0.085417 0.079178 0.091112 0.163891 0.153459 0.131238 0.124361 0.120435
qa: -0.0524 -0.0523 -0.0578 -0.3384 -0.3866 -0.1182 -0.0355 -0.2991 -0.1611 -0.0585 -0.0836 -0.0521 0.3072 -0.2498 0.2235 -0.1176 0.0089 0.0304 -0.0149 -0.0830 -0.1096 -0.1003 0.0425 0.1205 0.1204 0.1006 0.1092 0.0614 0.0625 0.1298 0.1047 0.0854 0.0792 0.0911 0.1639 0.1535 0.1312 0.1244 0.1204
va: 1.2709 1.2632 1.2435 1.9922 2.1101 3.0869 3.2515 3.1381 3.8610 3.9225 3.8745 3.8365 4.2774 3.9443 3.8336 3.9123 4.0399 3.9703 3.9843 4.0471 4.0258 4.0239 3.9557 0.9941 1.0165 1.0066 1.0126 1.0171 1.0153 1.0021 1.0108 1.0034 1.0035 1.0061 1.0101 1.0007 1.0080 1.0176 1.0188
dispcorr: -0.022955801 hartree
energy: -2276.665003647413
dipole: -41.65406 41.96520 0.31114 0.15579 -1.21030 -1.05451 2.70945 -3.70954 -1.00010
magnitude: 1.48627 au
magnitude: 3.77779 debye
