program: Orca
programVersion: 4.2.1
elementType: Cl Cl Cl O O N N N C C C C C C C C C C C C C C C H H H H H H H H H H H H H H H H
charge: 0
multiplicity: 1
keywords: wb97x-d3
keywords: def2-TZVPP
keywords: def2/J RIJCOSX GRIDX6 NOFINALGRIDX
keywords: grid4 nofinalgrid
keywords: scfconv7
keywords: smallprint printgap noloewdin
keywords: NOSOSCF
formula: C15H16Cl3N3O2
InChI: InChI=1S/C15H16Cl3N3O2/c1-2-4-20(15(22)21-5-3-19-10-21)6-7-23-14-12(17)8-11(16)9-13(14)18/h3,5,8-10H,2,4,6-7H2,1H3
39 atoms
Cl 2.779207 -2.609389 1.51893
Cl 0.137969 -0.019702 -2.394985
Cl 5.019806 1.60373 -0.901701
O  0.435493 -1.989272 -0.28356
O  -1.939343 0.056919 2.441006
N  -2.175331 -0.664415 0.302961
N  -2.457548 1.605752 0.867179
N  -3.202765 3.671847 1.072294
C  -3.022578 -0.616905 -0.88569
C  -1.742148 -1.98948 0.720772
C  -4.405518 -1.226076 -0.673506
C  -0.251695 -2.098636 0.964483
C  -2.178962 0.280723 1.27833
C  -5.23903 -0.515459 0.382618
C  1.49598 -1.179368 -0.381605
C  -2.015791 2.293852 -0.243542
C  -3.149904 2.504306 1.629688
C  2.650813 -1.312705 0.392079
C  1.498813 -0.174946 -1.351723
C  -2.488819 3.557997 -0.089522
C  3.732145 -0.45926 0.246703
C  2.573134 0.678346 -1.528244
C  3.680361 0.537836 -0.710014
H  -3.135334 0.411192 -1.220441
H  -2.496128 -1.143191 -1.682753
H  -2.020335 -2.694501 -0.062871
H  -2.259868 -2.305642 1.630117
H  -4.318549 -2.287715 -0.42507
H  -4.921838 -1.189297 -1.63634
H  0.084334 -1.338346 1.671549
H  -0.044426 -3.076301 1.404007
H  -4.813153 -0.619679 1.38134
H  -5.333596 0.550339 0.16923
H  -6.245537 -0.930927 0.424277
H  -1.388103 1.844233 -0.993056
H  -3.596072 2.225585 2.571145
H  -2.345738 4.39899 -0.74892
H  4.607639 -0.586055 0.866932
H  2.539085 1.445976 -2.287609
totalener: -2276.63914684 hartree
nucrepener: 2449.83923803 hartree
electener: -4726.47838487 hartree
oneelecener: -7998.16064554 hartree
twoeener: 3271.68226066 hartree
kineticenergy: 2270.87172695 hartree
xcener: -149.628244143293 hartree
chargesum: 0.0000000
charge: -0.056764 -0.074118 -0.059296 -0.316632 -0.371847 -0.111168 -0.007496 -0.295530 -0.134286 -0.091881 -0.099360 -0.017967 0.265849 -0.267311 0.227350 -0.168491 0.049439 0.004657 0.013508 -0.091023 -0.099701 -0.100074 0.040936 0.119228 0.101754 0.095957 0.113449 0.061436 0.075862 0.131930 0.101813 0.080035 0.092167 0.099722 0.171548 0.145282 0.131806 0.120404 0.118812
qa: -0.0568 -0.0741 -0.0593 -0.3166 -0.3718 -0.1112 -0.0075 -0.2955 -0.1343 -0.0919 -0.0994 -0.0180 0.2658 -0.2673 0.2274 -0.1685 0.0494 0.0047 0.0135 -0.0910 -0.0997 -0.1001 0.0409 0.1192 0.1018 0.0960 0.1134 0.0614 0.0759 0.1319 0.1018 0.0800 0.0922 0.0997 0.1715 0.1453 0.1318 0.1204 0.1188
va: 1.2532 1.2370 1.2422 2.0543 2.1254 3.0339 3.2197 3.1368 3.9110 3.9681 3.8767 3.8491 4.3193 3.9358 3.8936 3.8753 4.0423 3.9192 3.8875 4.0984 4.0239 4.0295 3.9636 0.9971 1.0097 1.0057 1.0114 1.0101 1.0130 0.9938 1.0020 1.0064 1.0027 1.0077 1.0259 1.0090 1.0095 1.0181 1.0195
dispcorr: -0.023845247 hartree
energy: -2276.662992089322
dipole: -44.35046 44.17635 -0.17411 -3.45951 1.99401 -1.46551 3.39767 -4.33104 -0.93337
magnitude: 1.74620 au
magnitude: 4.43848 debye
