program: Orca
programVersion: 4.2.1
elementType: Cl Cl Cl O O N N N C C C C C C C C C C C C C C C H H H H H H H H H H H H H H H H
charge: 0
multiplicity: 1
keywords: wb97x-d3
keywords: def2-TZVPP
keywords: def2/J RIJCOSX GRIDX6 NOFINALGRIDX
keywords: grid4 nofinalgrid
keywords: scfconv7
keywords: smallprint printgap noloewdin
keywords: NOSOSCF
formula: C15H16Cl3N3O2
InChI: InChI=1S/C15H16Cl3N3O2/c1-2-4-20(15(22)21-5-3-19-10-21)6-7-23-14-12(17)8-11(16)9-13(14)18/h3,5,8-10H,2,4,6-7H2,1H3
39 atoms
Cl 1.242456 -2.04217 -2.502809
Cl 1.464049 -0.319698 2.589232
Cl 3.986185 2.396905 -1.272578
O  0.575052 -2.082943 0.340297
O  -3.64659 0.977608 1.232915
N  -2.799293 -0.604978 -0.164787
N  -1.625383 1.381684 0.272216
N  -0.030817 2.826099 0.762987
C  -4.039015 -1.367989 -0.107282
C  -1.582297 -1.30898 -0.54236
C  -4.181722 -2.27966 1.105861
C  -0.768138 -1.75951 0.675548
C  -2.777211 0.581082 0.499079
C  -5.538399 -2.968908 1.121928
C  1.367845 -1.049513 -0.006795
C  -1.013366 1.714485 -0.918977
C  -0.994128 2.106199 1.244328
C  1.774758 -0.897128 -1.332011
C  1.845845 -0.124767 0.921553
C  -0.040776 2.602712 -0.587078
C  2.596171 0.1429 -1.729993
C  2.649276 0.936849 0.545436
C  3.011158 1.062537 -0.783272
H  -4.871319 -0.665015 -0.133032
H  -4.099557 -1.958203 -1.025379
H  -0.963653 -0.686033 -1.184218
H  -1.870393 -2.166555 -1.149557
H  -4.054217 -1.690307 2.015538
H  -3.39205 -3.036158 1.100969
H  -0.799878 -0.986686 1.446739
H  -1.182277 -2.666683 1.113522
H  -5.634813 -3.628361 1.983413
H  -6.349434 -2.241477 1.173401
H  -5.692526 -3.574194 0.226986
H  -1.349045 1.341971 -1.871202
H  -1.286515 2.042833 2.280568
H  0.651023 3.100287 -1.247909
H  2.892524 0.238002 -2.764564
H  2.974294 1.65789 1.280561
totalener: -2276.63547208 hartree
nucrepener: 2531.44405202 hartree
electener: -4808.07952410 hartree
oneelecener: -8161.46830525 hartree
twoeener: 3353.38878115 hartree
kineticenergy: 2270.87350570 hartree
xcener: -149.630716017799 hartree
chargesum: 0.0000000
charge: -0.059647 -0.059982 -0.061212 -0.314603 -0.358565 -0.156499 -0.012258 -0.301381 -0.075789 -0.111313 -0.091997 0.001836 0.313976 -0.262943 0.244364 -0.169510 0.034652 -0.041840 0.016566 -0.065222 -0.081446 -0.073254 0.025565 0.099111 0.092226 0.094860 0.115930 0.088322 0.056547 0.089485 0.102490 0.090280 0.088111 0.073019 0.162634 0.142779 0.129763 0.117235 0.117711
qa: -0.0596 -0.0600 -0.0612 -0.3146 -0.3586 -0.1565 -0.0123 -0.3014 -0.0758 -0.1113 -0.0920 0.0018 0.3140 -0.2629 0.2444 -0.1695 0.0347 -0.0418 0.0166 -0.0652 -0.0814 -0.0733 0.0256 0.0991 0.0922 0.0949 0.1159 0.0883 0.0565 0.0895 0.1025 0.0903 0.0881 0.0730 0.1626 0.1428 0.1298 0.1172 0.1177
va: 1.2553 1.2477 1.2392 2.0848 2.1443 3.1261 3.2350 3.0764 3.8818 3.8181 3.8259 3.8483 4.2926 3.9671 3.8230 3.8826 4.0323 3.9508 3.8944 4.0066 4.0100 3.9739 3.9253 1.0160 1.0025 1.0129 1.0088 1.0165 1.0150 1.0192 1.0158 1.0045 1.0028 1.0026 0.9956 1.0129 1.0090 1.0224 1.0263
dispcorr: -0.027138558 hartree
energy: -2276.662610635854
dipole: -41.85823 41.22693 -0.63130 -13.67793 12.34985 -1.32809 4.66958 -5.44902 -0.77944
magnitude: 1.66430 au
magnitude: 4.23030 debye
