program: Orca
programVersion: 4.2.1
elementType: Cl Cl Cl O O N N N C C C C C C C C C C C C C C C H H H H H H H H H H H H H H H H
charge: 0
multiplicity: 1
keywords: wb97x-d3
keywords: def2-TZVPP
keywords: def2/J RIJCOSX GRIDX6 NOFINALGRIDX
keywords: grid4 nofinalgrid
keywords: scfconv7
keywords: smallprint printgap noloewdin
keywords: NOSOSCF
formula: C15H16Cl3N3O2
InChI: InChI=1S/C15H16Cl3N3O2/c1-2-4-20(15(22)21-5-3-19-10-21)6-7-23-14-12(17)8-11(16)9-13(14)18/h3,5,8-10H,2,4,6-7H2,1H3
39 atoms
Cl 0.593832 -0.258808 -2.916469
Cl 1.935114 -2.098266 1.957256
Cl 4.188461 2.376675 0.048471
O  0.42975 -2.075665 -0.543572
O  -3.844668 0.996254 -0.058401
N  -2.611739 -0.595905 1.001087
N  -1.621796 1.386937 0.227164
N  -0.256871 2.840905 -0.717479
C  -3.809648 -1.353068 1.337649
C  -1.341402 -1.306862 0.976771
C  -4.324463 -2.270864 0.235356
C  -0.950549 -1.751839 -0.437278
C  -2.791947 0.592542 0.36611
C  -5.610432 -2.968984 0.652838
C  1.294391 -1.047644 -0.433675
C  -0.67544 1.71537 1.176655
C  -1.320775 2.12129 -0.88558
C  1.468246 -0.100009 -1.441984
C  2.088453 -0.924689 0.706396
C  0.146209 2.610516 0.569954
C  2.352434 0.955484 -1.305522
C  2.996654 0.108031 0.857378
C  3.105023 1.050881 -0.149536
H  -3.583256 -1.937744 2.233146
H  -4.590867 -0.646073 1.615964
H  -1.432422 -2.168145 1.637767
H  -0.550136 -0.691489 1.398983
H  -3.56873 -3.022622 -0.008774
H  -4.495264 -1.68477 -0.66937
H  -1.481167 -2.658571 -0.725202
H  -1.224083 -0.977319 -1.157703
H  -6.401254 -2.247621 0.862221
H  -5.97112 -3.632095 -0.132296
H  -5.4664 -3.572358 1.550724
H  -0.703942 1.334788 2.182799
H  -1.915766 2.062904 -1.783322
H  1.006811 3.105783 0.990518
H  2.437584 1.695478 -2.08727
H  3.596634 0.179912 1.752915
totalener: -2276.63545532 hartree
nucrepener: 2532.58050618 hartree
electener: -4809.21596150 hartree
oneelecener: -8163.73581682 hartree
twoeener: 3354.51985532 hartree
kineticenergy: 2270.87418536 hartree
xcener: -149.630922981700 hartree
chargesum: 0.0000000
charge: -0.059845 -0.059499 -0.061613 -0.314389 -0.357859 -0.155028 -0.010074 -0.302082 -0.077922 -0.114851 -0.093703 0.001341 0.312677 -0.262598 0.247346 -0.172146 0.033629 0.014752 -0.043025 -0.063953 -0.073073 -0.083979 0.027876 0.091724 0.099862 0.117036 0.097855 0.057615 0.088644 0.102803 0.089965 0.087783 0.090360 0.073490 0.162048 0.143275 0.129682 0.119001 0.116877
qa: -0.0598 -0.0595 -0.0616 -0.3144 -0.3579 -0.1550 -0.0101 -0.3021 -0.0779 -0.1149 -0.0937 0.0013 0.3127 -0.2626 0.2473 -0.1721 0.0336 0.0148 -0.0430 -0.0640 -0.0731 -0.0840 0.0279 0.0917 0.0999 0.1170 0.0979 0.0576 0.0886 0.1028 0.0900 0.0878 0.0904 0.0735 0.1620 0.1433 0.1297 0.1190 0.1169
va: 1.2477 1.2556 1.2390 2.0847 2.1452 3.1243 3.2320 3.0748 3.8819 3.8195 3.8261 3.8481 4.2916 3.9667 3.8197 3.8843 4.0321 3.8926 3.9540 4.0036 3.9690 4.0149 3.9254 1.0025 1.0165 1.0081 1.0111 1.0153 1.0164 1.0159 1.0185 1.0029 1.0048 1.0023 0.9961 1.0128 1.0090 1.0262 1.0227
dispcorr: -0.027177885 hartree
energy: -2276.662633201674
dipole: -41.23661 40.86961 -0.36701 -13.62537 12.28870 -1.33667 8.41291 -7.47638 0.93653
magnitude: 1.67286 au
magnitude: 4.25207 debye
