program: Orca
programVersion: 4.2.1
elementType: O O O O N N N C C C C C C C C C C C C C C C C C C H H H H H H H H H H H H H H H H H H H H H H H
charge: 0
multiplicity: 1
keywords: wb97x-d3
keywords: def2-TZVPP
keywords: def2/J RIJCOSX GRIDX6 NOFINALGRIDX
keywords: grid4 nofinalgrid
keywords: scfconv7
keywords: smallprint printgap noloewdin
keywords: NOSOSCF
formula: C18H23N3O4
InChI: InChI=1S/C18H23N3O4/c1-3-5-6-11-25-17(22)16(4-2)21(13-15-8-7-12-24-15)18(23)20-10-9-19-14-20/h3,7-10,12,14,16H,1,4-6,11,13H2,2H3
48 atoms
O  -0.390666 -1.237873 1.445032
O  -2.470247 -0.090343 -1.875966
O  0.070791 -0.971542 -0.724994
O  -0.296821 3.792488 -1.437503
N  -0.499502 1.775575 -0.403919
N  1.599385 2.629216 -1.030112
N  3.708485 3.266369 -1.058891
C  0.029438 0.969383 0.694295
C  -0.499097 1.42449 2.056272
C  -1.962242 1.85045 -0.510671
C  -0.121441 -0.51596 0.375355
C  0.196901 2.788438 -0.966363
C  -0.248705 2.906553 2.293465
C  -2.578275 0.512413 -0.66683
C  -0.51646 -2.66244 1.299639
C  0.827345 -3.359895 1.353062
C  -3.241032 -0.300389 0.192176
C  0.644517 -4.876804 1.295546
C  2.340995 1.504174 -1.328313
C  2.482777 3.659565 -0.89019
C  -3.546471 -1.491428 -0.53231
C  -3.04757 -1.306673 -1.775894
C  3.629863 1.924364 -1.344269
C  1.954415 -5.595937 1.324825
C  2.325851 -6.461018 2.260922
H  1.112031 1.114631 0.732436
H  -1.559773 1.196562 2.175476
H  0.025145 0.851455 2.82088
H  -2.210425 2.475761 -1.366212
H  -2.391949 2.337837 0.36703
H  -0.476818 3.165379 3.326947
H  0.796413 3.171724 2.117213
H  -0.866326 3.547319 1.6625
H  -1.054017 -2.89752 0.379205
H  -1.140926 -2.967405 2.138662
H  1.344774 -3.087493 2.276053
H  1.456387 -3.036192 0.520442
H  -3.477064 -0.08371 1.221812
H  0.113787 -5.135359 0.373082
H  0.016929 -5.210959 2.125983
H  1.895398 0.546753 -1.536218
H  2.166424 4.660717 -0.644638
H  -4.062909 -2.365585 -0.171316
H  -3.039193 -1.920528 -2.662179
H  4.507676 1.334972 -1.553644
H  2.639682 -5.36942 0.512075
H  3.291685 -6.948891 2.231235
H  1.677064 -6.716599 3.091111
elementType: O N C H
totalener: -1165.01676650 hartree
nucrepener: 2308.12167537 hartree
electener: -3473.13844187 hartree
oneelecener: -6172.49837678 hartree
twoeener: 2699.35993492 hartree
cpcmener: -0.04336484 hartree
kineticenergy: 1160.01723692 hartree
xcener: -111.462136589663 hartree
chargesum: 0.0000000
charge: -0.272308 -0.285871 -0.462318 -0.478734 -0.097639 -0.024251 -0.387884 0.006092 -0.101095 -0.089456 0.383488 0.375824 -0.285008 0.185735 0.016356 -0.121772 -0.221388 -0.045679 -0.179266 0.068757 -0.227006 -0.006587 -0.110427 -0.214196 -0.292431 0.137839 0.086317 0.086624 0.127926 0.142905 0.109978 0.090006 0.080391 0.100337 0.118652 0.080505 0.085549 0.166818 0.089234 0.072310 0.206954 0.173553 0.175768 0.180736 0.172006 0.138175 0.131202 0.113280
qa: -0.2723 -0.2859 -0.4623 -0.4787 -0.0976 -0.0243 -0.3879 0.0061 -0.1011 -0.0895 0.3835 0.3758 -0.2850 0.1857 0.0164 -0.1218 -0.2214 -0.0457 -0.1793 0.0688 -0.2270 -0.0066 -0.1104 -0.2142 -0.2924 0.1378 0.0863 0.0866 0.1279 0.1429 0.1100 0.0900 0.0804 0.1003 0.1187 0.0805 0.0855 0.1668 0.0892 0.0723 0.2070 0.1736 0.1758 0.1807 0.1720 0.1382 0.1312 0.1133
va: 2.1478 2.2703 2.0152 2.0219 3.0705 3.2614 3.1144 3.9507 3.8941 3.9179 4.1528 4.2514 3.9407 3.4981 3.8149 3.8689 3.8858 3.8498 3.9145 4.0206 3.8912 3.8607 4.0549 3.8201 3.9412 0.9843 1.0081 1.0189 1.0263 0.9942 1.0043 1.0026 1.0093 1.0156 1.0018 1.0206 1.0265 1.0003 1.0051 1.0171 1.0012 1.0003 0.9915 0.9869 1.0002 0.9997 1.0023 1.0112
dispcorr: -0.027215003 hartree
energy: -1165.043981503693
dipole: 0.52406 -2.41552 -1.89146 -20.03820 17.64551 -2.39269 18.49521 -15.98161 2.51360
magnitude: 3.95231 au
magnitude: 10.04598 debye
