program: Orca
programVersion: 4.2.1
elementType: O O O O N N N C C C C C C C C C C C C C C C C C C H H H H H H H H H H H H H H H H H H H H H H H
charge: 0
multiplicity: 1
keywords: wb97x-d3
keywords: def2-TZVPP
keywords: def2/J RIJCOSX GRIDX6 NOFINALGRIDX
keywords: grid4 nofinalgrid
keywords: scfconv7
keywords: smallprint printgap noloewdin
keywords: NOSOSCF
formula: C18H23N3O4
InChI: InChI=1S/C18H23N3O4/c1-3-5-6-11-25-17(22)16(4-2)21(13-15-8-7-12-24-15)18(23)20-10-9-19-14-20/h3,7-10,12,14,16H,1,4-6,11,13H2,2H3
48 atoms
O  0.656875 -0.536106 0.668878
O  -3.275212 0.018073 0.271662
O  -0.914135 -0.406394 2.253052
O  0.415873 0.96709 -2.366965
N  -0.420517 1.752445 -0.396667
N  1.878194 1.832942 -0.875164
N  4.060833 1.632763 -0.655072
C  -0.222718 1.596796 1.051003
C  -1.201911 2.419207 1.879137
C  -1.784968 1.546325 -0.888181
C  -0.228932 0.107754 1.406255
C  0.574283 1.463465 -1.273137
C  -0.717519 2.626943 3.307063
C  -2.311895 0.16932 -0.672426
C  0.704745 -1.969449 0.728708
C  1.530224 -2.444648 -0.446432
C  -2.012698 -1.040045 -1.21016
C  1.505108 -3.969487 -0.567295
C  2.301962 2.946911 -0.181226
C  2.986316 1.084389 -1.135631
C  -2.837541 -1.995096 -0.545698
C  -3.579272 -1.294313 0.342283
C  3.645388 2.801985 -0.064873
C  0.149715 -4.486918 -0.932328
C  -0.589283 -5.293667 -0.180227
H  0.779438 1.949824 1.300592
H  -1.30748 3.395319 1.401728
H  -2.193088 1.964832 1.889221
H  -1.804611 1.800628 -1.945206
H  -2.433713 2.269196 -0.395462
H  0.247789 3.135255 3.32836
H  -1.42598 3.246752 3.855762
H  -0.614302 1.689972 3.852126
H  -0.309971 -2.369157 0.684721
H  1.153485 -2.280307 1.675196
H  2.563016 -2.106564 -0.334505
H  1.146573 -1.999771 -1.369719
H  -1.287245 -1.230779 -1.983937
H  1.846978 -4.427512 0.364807
H  2.221368 -4.259119 -1.340697
H  1.640658 3.743185 0.115105
H  2.938034 0.14811 -1.668027
H  -2.86588 -3.060373 -0.706481
H  -4.337166 -1.577943 1.054389
H  4.339095 3.481105 0.403492
H  -0.245658 -4.147712 -1.886963
H  -1.567773 -5.62879 -0.49979
H  -0.242522 -5.65256 0.782324
elementType: O N C H
totalener: -1165.01471107 hartree
nucrepener: 2407.31003574 hartree
electener: -3572.32474681 hartree
oneelecener: -6371.27234934 hartree
twoeener: 2798.94760253 hartree
cpcmener: -0.03939369 hartree
kineticenergy: 1160.03771724 hartree
xcener: -111.464089435364 hartree
chargesum: 0.0000000
charge: -0.267903 -0.274487 -0.434195 -0.463747 -0.139636 -0.005004 -0.390627 0.103787 -0.101052 -0.059886 0.310327 0.377500 -0.288058 0.195204 -0.021717 -0.136454 -0.266748 -0.062101 -0.171626 0.065816 -0.175569 -0.036546 -0.108327 -0.203309 -0.281008 0.124108 0.093445 0.079426 0.131694 0.134600 0.084766 0.100561 0.088041 0.090977 0.134720 0.095506 0.078506 0.158595 0.076347 0.094922 0.201526 0.168275 0.172675 0.177792 0.171764 0.133186 0.129413 0.114522
qa: -0.2679 -0.2745 -0.4342 -0.4637 -0.1396 -0.0050 -0.3906 0.1038 -0.1011 -0.0599 0.3103 0.3775 -0.2881 0.1952 -0.0217 -0.1365 -0.2667 -0.0621 -0.1716 0.0658 -0.1756 -0.0365 -0.1083 -0.2033 -0.2810 0.1241 0.0934 0.0794 0.1317 0.1346 0.0848 0.1006 0.0880 0.0910 0.1347 0.0955 0.0785 0.1586 0.0763 0.0949 0.2015 0.1683 0.1727 0.1778 0.1718 0.1332 0.1294 0.1145
va: 2.1553 2.2713 2.0536 2.0278 3.0870 3.2627 3.1091 3.8850 3.8656 3.8819 4.1942 4.2586 3.9517 3.3990 3.8344 3.8906 3.9030 3.9087 3.9139 4.0411 3.8641 3.8926 4.0398 3.7839 3.9210 0.9992 1.0105 1.0201 1.0136 1.0027 1.0011 1.0016 1.0124 1.0049 1.0033 1.0113 1.0159 1.0137 1.0128 1.0059 0.9825 1.0008 0.9941 0.9883 0.9992 1.0018 1.0033 1.0100
dispcorr: -0.030901971 hartree
energy: -1165.045613043354
dipole: -1.70173 0.62419 -1.07754 -10.70723 11.15304 0.44581 7.90485 -7.23171 0.67314
magnitude: 1.34646 au
magnitude: 3.42243 debye
