program: Gaussian 09
title: 000029971
version: EM64L-G09RevD.01
frameworkgroup: C1[X(C4H10N2O)]
method: RPBEPBE
basis: SDD
operation: Freq
keyword: #p
keyword: freq=noraman
keyword: PBEPBE/SDD
title: #p freq=noraman PBEPBE/SDD
converged: YES YES NO NO
title: Mulliken charges:
elementType: O N N C C C C H H H H H H H H H H
charge: -0.229732 -0.240390 -0.376991 -0.320466 -0.682459 0.265336 -0.764252 0.177241 0.236621 0.276818 0.246949 0.202140 0.218004 0.276380 0.253460 0.205752 0.255588
chargesum: 0.00000
title: Mulliken charges with hydrogens summed into heavy atoms:
elementType: O N N C C C C
charge: -0.229732 0.036428 -0.100611 0.093396 -0.015366 0.265336 -0.049451
polarizability: 8.09091491e+01 1.32795578e-01 6.05136344e+01 2.71705061e+00 2.64020627e-01 4.79129819e+01
1716.lowfreq: -8.9898 -5.2859 -0.0007 -0.0005 0.0004 14.5857 48.4896 74.3337 80.6025
frequency: 48.1659 74.2250 80.5848 110.4342 239.7873 270.3936 306.8584 350.8934 441.3945 526.0125 558.0966 618.7035 669.4168 815.8853 896.0427 905.8725 968.8418 1036.9677 1050.7839 1115.9783 1164.6542 1171.4841 1250.3959 1262.8580 1347.3543 1381.9952 1391.8042 1425.0907 1450.4090 1467.7543 1471.4405 1481.9624 1492.3993 1513.2104 1654.3362 2866.4901 2983.7751 2993.2308 3034.9249 3078.2377 3093.3892 3101.8711 3102.5255 3383.3440 3454.3693
redmass: 2.9202 1.6455 1.7993 1.9437 1.2620 1.9656 3.5476 3.3236 1.9359 2.3281 1.8639 1.9266 2.6560 1.1081 2.0080 2.7282 1.9417 1.6486 2.9062 1.8108 2.1094 4.0199 1.3989 1.8612 1.3315 1.2179 1.2312 1.2040 1.0458 1.0778 1.0616 1.0451 1.1672 1.3142 7.4377 1.0723 1.0380 1.0363 1.0879 1.0971 1.0997 1.0983 1.1006 1.0764 1.0762
irintensity: 2.9806 3.3960 2.0770 1.8166 0.8419 12.6441 0.1406 6.0688 46.7430 47.8031 75.2973 28.0807 30.0077 3.6857 4.2858 1.1305 21.5949 13.2201 2.1638 5.3271 5.7280 93.8001 11.7053 44.8025 4.4598 44.2004 25.3662 24.8978 14.5294 23.8010 23.1761 8.4164 5.2814 48.4226 210.8274 118.4217 29.2625 13.6260 13.0107 51.9240 23.4127 9.5404 28.9599 37.6726 0.6253
temp: 298.150 k
press: 1.00000 atm
elementType: 8 7 7 6 6 6 6 1 1 1 1 1 1 1 1 1 1
symmnumber: 1
zpe: 377449.6 jmol-1
zpe.correction: 0.143763 hartree
zpe.thermalcorrener: 0.152815 hartree
zpe.thermalcorrenthalpy: 0.153759 hartree
zpe.thermalcorrgfe: 0.109277 hartree
zpe.sumelectzpe: -342.541749 hartree
zpe.sumelectthermal: -342.532697 hartree
zpe.sumelectthermalent: -342.531753 hartree
zpe.sumelectthermalfe: -342.576235 hartree
dipole: -1.3681 -4.7164 -0.3452
dipole: 4.9229
quadrupole: -37.9504 -47.3733 -41.1414
quadrupole: -4.7582 0.7363 0.7581
quadrupole: 4.2046 -5.2182 1.0136 -4.7582 0.7363 0.7581
hfenergy: -342.6855122 hartree
pointgroup: C01 [X(C4H10N2O1)]
dipole: 0.6014554 -1.8374937 0.1149014 debye
dipolederiv: -0.5927786 -0.0003616 -0.0314435 0.2803769 -1.0270676 0.0564201 -0.0512706 0.0262147 -0.3616081 -0.286226 0.0207041 0.1193634 0.1683587 -0.4789679 -0.1041355 0.1132804 -0.1305929 -0.0352761 -0.5443129 0.4855879 -0.0037234 0.3618314 -0.1902094 0.0837886 0.061683 0.1951793 -0.5148692 0.3400089 -0.1483159 -0.2005417 -0.1273792 0.4375162 0.0238948 -0.341305 0.0768671 0.3145041 -0.1101259 -0.0495676 0.030359 -0.0350634 0.0218046 -0.0364144 0.0579909 -0.0244243 0.0837065 1.3709464 -0.2524457 0.2276003 -0.5192165 1.3078055 -0.102888 0.2800132 -0.1234598 0.2417223 -0.3759289 -0.1872828 -0.0631836 -0.1517925 -0.0510442 -0.0357088 -0.0791955 -0.0380744 0.0040216 -0.055455 0.0021378 0.0480786 0.0941659 -0.2917687 -0.107937 0.0856053 -0.0245145 0.0076644 0.0092903 0.0301109 -0.0822172 0.0341635 0.0376093 0.0591374 -0.0181156 0.0378301 -0.118782 -0.0011886 -0.0116977 -0.0683626 0.008709 0.2789358 0.1298859 -0.015436 0.0326918 0.041806 0.1025375 0.0489197 -0.0058408 -0.0113959 -0.1285603 -0.026804 -0.0274998 -0.0367128 0.0963211 0.0492965 0.0094795 -0.0629988 0.022974 0.0456679 0.1026485 -0.1242087 0.0743112 -0.1245633 -0.0726791 0.0117905 0.1075057 0.0238055 0.1019715 -0.0400963 0.1415267 -0.0279719 -0.0307334 0.009443 -0.0459511 -0.0318949 -0.1687433 -0.0565132 -0.0114555 -0.0969511 -0.0583856 0.3094853 0.0845751 0.0003942 -0.0487496 -0.002129 0.0831801 0.0579487 -0.0884478 0.0273753 -0.0540284 0.0684312 0.0678197 -0.0169359 -0.0088064 -0.1696585 0.0092226 -0.0115708 0.0239398 0.110286 0.004166 0.0186781 0.0829849 0.0301412 0.079299 -0.057507 0.1139014 -0.030273 0.0303431 unknown
polarizability: 80.9439479|0.5295983|60.5297525|2.4146423|-0.073313|47.862065 unknown
InChI: InChI=1S/C4H10N2O/c1-3-5-6-4(2)7/h5-6H,3H2,1-2H3
charge 0 multiplicity 1
17 atoms
O  -1.457587 1.346734 -0.00196
N  0.92291 -0.124323 0.569746
N  -0.344292 -0.692922 0.361736
C  1.933179 -0.404497 -0.472451
C  3.259074 0.283238 -0.106083
C  -1.46773 0.089672 0.055154
C  -2.732392 -0.73839 -0.194679
H  2.104577 -1.501033 -0.617256
H  1.551065 -0.003631 -1.428558
H  1.253153 -0.235552 1.536262
H  3.105635 1.370031 0.006319
H  3.671863 -0.11016 0.843056
H  4.012527 0.112249 -0.894819
H  -0.442683 -1.717713 0.319138
H  -3.119441 -0.501423 -1.200387
H  -2.577478 -1.829437 -0.118457
H  -3.50448 -0.438042 0.53424
