program: Orca
programVersion: 4.2.1
elementType: O O O O N N N C C C C C C C C C C C C C C C C C C H H H H H H H H H H H H H H H H H H H H H H H
charge: 0
multiplicity: 1
keywords: wb97x-d3
keywords: def2-TZVPP
keywords: def2/J RIJCOSX GRIDX6 NOFINALGRIDX
keywords: grid4 nofinalgrid
keywords: scfconv7
keywords: smallprint printgap noloewdin
keywords: NOSOSCF
formula: C18H23N3O4
InChI: InChI=1S/C18H23N3O4/c1-3-5-6-11-25-17(22)16(4-2)21(13-15-8-7-12-24-15)18(23)20-10-9-19-14-20/h3,7-10,12,14,16H,1,4-6,11,13H2,2H3
48 atoms
O  0.068883 -1.109498 0.065755
O  -3.653766 0.355308 0.188163
O  -1.421274 -1.188116 1.730593
O  0.157983 1.398214 -2.277974
N  -0.491061 1.593464 -0.100942
N  1.776557 1.470704 -0.701028
N  3.92369 0.987397 -0.813206
C  -0.32219 0.91009 1.186507
C  -1.089459 1.564556 2.325899
C  -1.869907 1.843933 -0.524199
C  -0.652532 -0.5762 1.032444
C  0.421152 1.461896 -1.096582
C  -0.708124 3.020903 2.536243
C  -2.684187 0.6132 -0.725636
C  -0.115353 -2.497884 -0.254625
C  1.003147 -2.917891 -1.177316
C  -2.659082 -0.378251 -1.651213
C  2.39658 -2.82212 -0.551202
C  2.391729 2.196584 0.297917
C  2.756532 0.769796 -1.338993
C  -3.672464 -1.30899 -1.275175
C  -4.238688 -0.811399 -0.151792
C  3.707685 1.883542 0.205785
C  2.52866 -3.650105 0.685962
C  2.761236 -3.164247 1.899678
H  0.733504 0.942222 1.462747
H  -2.167543 1.468431 2.19364
H  -0.850161 1.002687 3.229791
H  -1.839537 2.432927 -1.437988
H  -2.345699 2.479102 0.222866
H  0.35821 3.129312 2.741689
H  -0.947911 3.648824 1.677503
H  -1.244303 3.428173 3.393065
H  -1.086896 -2.6221 -0.737758
H  -0.111994 -3.092668 0.660414
H  0.970577 -2.328678 -2.097351
H  0.800493 -3.951467 -1.469903
H  -1.992843 -0.443124 -2.495767
H  2.641275 -1.782003 -0.326792
H  3.124621 -3.158159 -1.295108
H  1.865264 2.887257 0.933737
H  2.548502 0.115936 -2.170811
H  -3.941078 -2.224624 -1.776172
H  -5.03895 -1.154616 0.483729
H  4.514514 2.262111 0.812089
H  2.405394 -4.723351 0.561523
H  2.839698 -3.809835 2.765064
H  2.886298 -2.101214 2.074642
elementType: O N C H
totalener: -1165.01563647 hartree
nucrepener: 2419.57476706 hartree
electener: -3584.59040353 hartree
oneelecener: -6395.87936207 hartree
twoeener: 2811.28895854 hartree
cpcmener: -0.04019242 hartree
kineticenergy: 1160.03572849 hartree
xcener: -111.464655502236 hartree
chargesum: 0.0000000
charge: -0.249614 -0.277056 -0.439697 -0.467866 -0.128940 0.007128 -0.384134 0.052241 -0.081904 -0.071948 0.317958 0.388537 -0.291213 0.215489 -0.061818 -0.137701 -0.293967 -0.034568 -0.174280 0.040351 -0.175166 -0.040366 -0.116956 -0.210553 -0.275350 0.139977 0.077338 0.088244 0.129706 0.135793 0.084628 0.088815 0.107169 0.133471 0.118234 0.083580 0.094175 0.162140 0.050995 0.098016 0.214682 0.175581 0.180134 0.178645 0.172781 0.136365 0.134086 0.106838
qa: -0.2496 -0.2771 -0.4397 -0.4679 -0.1289 0.0071 -0.3841 0.0522 -0.0819 -0.0719 0.3180 0.3885 -0.2912 0.2155 -0.0618 -0.1377 -0.2940 -0.0346 -0.1743 0.0404 -0.1752 -0.0404 -0.1170 -0.2106 -0.2754 0.1400 0.0773 0.0882 0.1297 0.1358 0.0846 0.0888 0.1072 0.1335 0.1182 0.0836 0.0942 0.1621 0.0510 0.0980 0.2147 0.1756 0.1801 0.1786 0.1728 0.1364 0.1341 0.1068
va: 2.1436 2.2736 2.0582 2.0266 3.0426 3.2526 3.0843 3.9135 3.8740 3.8850 4.2523 4.2401 3.9499 3.3707 3.8543 3.9257 3.9156 3.8477 3.9098 4.0158 3.8759 3.8851 4.0481 3.8150 3.9221 0.9915 1.0197 1.0155 1.0145 1.0006 1.0011 1.0057 1.0039 0.9979 1.0092 1.0168 1.0145 1.0158 1.0301 1.0074 0.9761 0.9955 0.9881 0.9880 0.9996 1.0009 1.0021 1.0111
dispcorr: -0.030943662 hartree
energy: -1165.046580134783
dipole: 3.88569 -4.98867 -1.10298 -6.73466 6.87170 0.13703 8.85648 -8.07503 0.78145
magnitude: 1.35868 au
magnitude: 3.45349 debye
