program: Orca
programVersion: 4.2.1
elementType: O O O O N N N C C C C C C C C C C C C C C C C C C H H H H H H H H H H H H H H H H H H H H H H H
charge: 0
multiplicity: 1
keywords: wb97x-d3
keywords: def2-TZVPP
keywords: def2/J RIJCOSX GRIDX6 NOFINALGRIDX
keywords: grid4 nofinalgrid
keywords: scfconv7
keywords: smallprint printgap noloewdin
keywords: NOSOSCF
formula: C18H23N3O4
InChI: InChI=1S/C18H23N3O4/c1-3-5-6-11-25-17(22)16(4-2)21(13-15-8-7-12-24-15)18(23)20-10-9-19-14-20/h3,7-10,12,14,16H,1,4-6,11,13H2,2H3
48 atoms
O  0.247363 -0.871443 1.103891
O  -1.54528 -0.482252 -1.733438
O  -1.068827 -0.328055 2.82499
O  -0.127631 2.708985 -1.888781
N  -0.479465 1.621811 0.074562
N  1.680681 2.253294 -0.602453
N  3.754752 1.585023 -0.282959
C  -0.094527 1.422243 1.469838
C  -0.734087 2.443706 2.405724
C  -1.891206 1.408008 -0.246021
C  -0.381001 -0.01784 1.884716
C  0.286843 2.216637 -0.860243
C  -0.411368 3.871901 1.996871
C  -2.177208 0.005819 -0.639226
C  0.030964 -2.277074 1.304041
C  0.727267 -3.012843 0.181998
C  -2.991687 -0.940557 -0.115665
C  0.35561 -4.49455 0.196142
C  2.479602 3.353469 -0.817266
C  2.50931 1.214942 -0.29326
C  -2.849322 -2.09708 -0.943767
C  -1.95697 -1.761878 -1.901598
C  3.746735 2.921759 -0.596049
C  1.028089 -5.244936 -0.907257
C  0.395289 -5.850755 -1.904717
H  0.985344 1.547807 1.55955
H  -1.814739 2.306437 2.472573
H  -0.34162 2.254276 3.40591
H  -2.190916 2.103588 -1.028597
H  -2.501837 1.652223 0.622577
H  -0.868107 4.145119 1.044497
H  -0.787676 4.57113 2.74291
H  0.665329 4.033722 1.913136
H  -1.042061 -2.480815 1.293202
H  0.425751 -2.5737 2.278448
H  1.810552 -2.895033 0.270745
H  0.431671 -2.580886 -0.776639
H  -3.613713 -0.831833 0.758118
H  -0.729413 -4.59884 0.10803
H  0.640665 -4.929599 1.1596
H  2.080607 4.318929 -1.07724
H  2.145804 0.21446 -0.122486
H  -3.339932 -3.049772 -0.830294
H  -1.536946 -2.29883 -2.736598
H  4.654951 3.500078 -0.642677
H  2.114217 -5.269251 -0.877863
H  0.934229 -6.37037 -2.68649
H  -0.686303 -5.848898 -1.978692
elementType: O N C H
totalener: -1165.01668144 hartree
nucrepener: 2353.13367297 hartree
electener: -3518.15035441 hartree
oneelecener: -6262.24598301 hartree
twoeener: 2744.09562859 hartree
cpcmener: -0.04271106 hartree
kineticenergy: 1160.03677563 hartree
xcener: -111.462780342939 hartree
chargesum: -0.0000000
charge: -0.251780 -0.287861 -0.441420 -0.475235 -0.102591 -0.024897 -0.383693 -0.024999 -0.108234 -0.059485 0.392264 0.373640 -0.289847 0.239378 -0.050427 -0.145535 -0.314059 -0.040854 -0.143793 0.030941 -0.165295 -0.048656 -0.109570 -0.213529 -0.289238 0.144386 0.077234 0.089468 0.136767 0.152704 0.086925 0.108416 0.089977 0.115022 0.138795 0.105630 0.090607 0.165264 0.072751 0.092126 0.189360 0.185546 0.168994 0.176864 0.169395 0.137588 0.131636 0.109320
qa: -0.2518 -0.2879 -0.4414 -0.4752 -0.1026 -0.0249 -0.3837 -0.0250 -0.1082 -0.0595 0.3923 0.3736 -0.2898 0.2394 -0.0504 -0.1455 -0.3141 -0.0409 -0.1438 0.0309 -0.1653 -0.0487 -0.1096 -0.2135 -0.2892 0.1444 0.0772 0.0895 0.1368 0.1527 0.0869 0.1084 0.0900 0.1150 0.1388 0.1056 0.0906 0.1653 0.0728 0.0921 0.1894 0.1855 0.1690 0.1769 0.1694 0.1376 0.1316 0.1093
va: 2.1414 2.2514 2.0525 2.0256 3.0770 3.2592 3.1085 3.9634 3.8904 3.8361 4.2014 4.2577 3.9572 3.3920 3.8318 3.8703 3.9210 3.8566 3.9234 4.0148 3.8313 3.8517 4.0173 3.8097 3.9418 0.9868 1.0122 1.0161 1.0221 0.9942 1.0037 1.0062 1.0006 0.9949 1.0034 1.0126 1.0141 1.0064 1.0161 1.0073 0.9936 1.0085 0.9959 0.9925 0.9981 1.0008 1.0024 1.0119
dispcorr: -0.029065662 hartree
energy: -1165.045747099116
dipole: -2.65174 1.45381 -1.19793 -12.07483 11.48561 -0.58922 6.25582 -5.06238 1.19344
magnitude: 1.79067 au
magnitude: 4.55153 debye
