program: Gaussian 09
title: 000003209
version: EM64L-G09RevD.01
frameworkgroup: C1[X(C20H30O2)]
method: RPBEPBE
basis: SDD
operation: Freq
keyword: #pfreq=noraman
keyword: PBEPBE/SDD
title: #p freq=noraman PBEPBE/SDD
converged: YES YES NO NO
title: Mulliken charges:
elementType: O O C C C C C C C C C C C C C C C C C C C C H H H H H H H H H H H H H H H H H H H H H H H H H H H H H H
charge: -0.432498 -0.236901 -0.381405 -0.471703 -0.476173 -0.181187 -0.537910 -0.162620 -0.161745 -0.537290 0.187674 -0.159526 -0.531304 -0.155505 -0.548517 -0.156167 -0.189386 -0.175842 -0.178334 -0.429570 -0.171881 -0.673129 0.219781 0.214783 0.204778 0.211970 0.274476 0.272962 0.223901 0.209047 0.205628 0.224412 0.219071 0.207084 0.204243 0.218086 0.211747 0.204330 0.222942 0.203207 0.204048 0.219413 0.215891 0.282979 0.238217 0.200730 0.200788 0.221835 0.211921 0.222705 0.215858 0.374087
chargesum: 0.00000
title: Mulliken charges with hydrogens summed into heavy atoms:
elementType: O O C C C C C C C C C C C C C C C C C C C C
charge: -0.058411 -0.236901 0.053159 -0.054954 0.071266 0.042714 -0.123236 0.061792 0.057326 -0.125963 0.187674 0.058560 -0.115226 0.067436 -0.141262 0.063247 0.026505 0.107137 0.059883 -0.028052 0.049954 -0.022646
polarizability: 2.56311983e+02 -2.17117412e+01 2.31257375e+02 4.81195531e+00 3.04014966e+00 1.94056667e+02
1716.lowfreq: -7.8170 -5.5045 -0.0008 -0.0007 -0.0005 5.6670 13.0172 13.4802 19.3455
frequency: 11.5207 12.7879 19.3032 26.8087 33.3860 35.1573 42.8239 48.6067 61.0488 68.9571 79.1476 96.7404 111.2988 120.6992 139.7310 157.4976 159.8404 166.7131 177.6129 193.6707 215.8916 239.7965 252.6800 270.5985 286.6652 298.1259 304.7989 335.1783 375.1685 403.9586 426.9325 440.2531 447.8252 468.4603 493.0251 507.5606 511.5060 518.3144 544.6034 588.3366 638.2784 750.8577 753.5588 768.7285 785.9360 805.1926 815.4945 830.0160 833.5232 863.6070 879.5236 893.4906 912.4033 922.1526 928.8969 943.8121 962.5662 969.5278 975.4810 978.5197 987.4044 992.0560 1002.7565 1008.2822 1030.0882 1038.8212 1047.2774 1055.2799 1067.7448 1073.2795 1076.2625 1080.1926 1097.7312 1104.6746 1115.3177 1130.9552 1148.8761 1170.7416 1182.0491 1193.4911 1200.5567 1203.3459 1236.3509 1245.1294 1245.5865 1252.2263 1260.1705 1270.7944 1277.1735 1286.0798 1287.5958 1288.2696 1291.1040 1293.8554 1298.2014 1302.4657 1307.8703 1319.9219 1323.1021 1332.9961 1338.3371 1341.1515 1374.5193 1385.8449 1440.5812 1453.7638 1455.1692 1457.9761 1458.1744 1459.8008 1460.2758 1470.7600 1474.1633 1483.2281 1666.8834 1668.1429 1675.1085 1678.7501 1683.1968 1687.2227 2952.0079 2952.2580 2958.5381 2961.1617 2962.2481 2963.6421 2977.5376 2981.9796 2995.1056 3016.6498 3019.0838 3020.9499 3027.3446 3033.7753 3035.1256 3036.1438 3056.9567 3063.8163 3064.1320 3067.7189 3071.3432 3073.8178 3075.3503 3077.2877 3079.6999 3082.7767 3083.3537 3087.0868 3097.4521 3505.5039
redmass: 3.5033 6.4868 7.6867 2.2246 5.0353 4.2586 3.5617 4.9973 5.1025 3.1305 3.4580 2.3377 2.5846 2.0332 2.0408 2.4764 2.4184 3.8394 2.7941 1.3431 2.6522 2.9085 2.5641 2.4144 2.8103 2.4762 2.1539 2.9600 2.8300 2.2065 4.2871 2.8222 2.9227 2.4782 2.6712 1.7680 2.4569 2.9158 2.5887 4.4411 1.3313 1.3655 1.2999 1.5774 1.6018 1.5325 1.6201 1.9598 2.1362 1.9054 2.5567 2.1437 1.9829 1.9156 1.9306 1.8408 1.2156 1.2250 1.1987 1.1277 1.5206 1.7283 1.5544 1.7588 3.0116 2.2170 2.5930 2.7213 2.0763 1.9472 2.1627 2.3023 2.5149 2.3327 1.7903 1.7741 1.8068 1.5424 1.4139 1.2979 1.2750 1.2539 1.2227 1.3638 1.3472 1.2817 1.2240 1.2444 1.2266 1.2675 1.2589 1.2704 1.2673 1.2556 1.2611 1.2460 1.2987 1.4285 1.3348 1.4396 1.4161 1.4085 1.7578 1.2009 1.0827 1.0897 1.0934 1.0920 1.0934 1.0955 1.0780 1.0899 1.0428 1.0603 7.7197 6.6908 6.3816 6.5158 6.2936 6.6349 1.0641 1.0627 1.0632 1.0627 1.0585 1.0602 1.0352 1.0615 1.0620 1.0964 1.1001 1.0972 1.0981 1.0954 1.0956 1.0947 1.1005 1.0946 1.0933 1.0916 1.0932 1.0991 1.0912 1.0915 1.0902 1.0994 1.0893 1.0880 1.0902 1.0638
irintensity: 0.1288 0.3756 0.5245 0.0208 0.1803 0.0729 0.2519 0.0912 0.5833 0.1495 0.0470 0.9560 0.7010 0.1160 0.0484 0.2536 1.3966 2.0216 0.3067 0.7974 0.3737 2.9753 1.1014 2.4469 0.6275 1.4327 2.1157 3.3063 3.1505 3.0829 14.6039 10.7641 7.8102 0.9384 5.9526 22.2898 1.8435 3.1731 0.6201 13.1469 104.4126 13.8846 3.3252 1.0637 6.8559 1.6951 9.9649 1.3246 1.6013 3.2219 7.9683 2.9646 9.7573 3.7365 12.9975 1.6534 12.8360 43.4666 82.6335 48.5697 28.6813 86.0741 7.0650 35.9780 25.6623 16.6927 96.4540 0.9908 2.0844 62.0975 27.1235 6.2851 0.4804 7.0997 3.6666 2.6499 6.3349 0.4455 2.7669 3.5845 4.9329 0.9246 0.1187 1.5089 0.3077 1.0409 0.3182 1.4646 2.1742 1.1127 0.4874 0.7635 2.5228 1.6360 1.3926 0.1246 3.2730 21.6465 7.3721 2.6766 4.4906 0.5373 27.6027 8.7262 20.0860 14.6216 14.5521 19.6885 5.1209 10.7669 9.8530 16.8931 11.5847 10.7877 229.4184 18.7932 0.5059 0.7243 0.5470 0.7707 52.3552 46.3164 47.4532 53.0915 35.0647 34.0268 47.6529 7.1859 24.1969 15.7147 16.8279 21.9107 14.4740 16.8263 0.8916 1.4365 14.0480 32.1546 1.7448 16.7722 19.7889 32.5122 15.6718 12.4154 54.2775 48.3957 14.0596 130.9232 12.2275 17.6515
temp: 298.150 k
press: 1.00000 atm
elementType: 8 8 6 6 6 6 6 6 6 6 6 6 6 6 6 6 6 6 6 6 6 6 1 1 1 1 1 1 1 1 1 1 1 1 1 1 1 1 1 1 1 1 1 1 1 1 1 1 1 1 1 1
symmnumber: 1
zpe: 1169490.7 jmol-1
zpe.correction: 0.445435 hartree
zpe.thermalcorrener: 0.472352 hartree
zpe.thermalcorrenthalpy: 0.473296 hartree
zpe.thermalcorrgfe: 0.382055 hartree
zpe.sumelectzpe: -928.776264 hartree
zpe.sumelectthermal: -928.749347 hartree
zpe.sumelectthermalent: -928.748403 hartree
zpe.sumelectthermalfe: -928.839644 hartree
dipole: -0.2731 0.5141 -1.3666
dipole: 1.4854
quadrupole: -134.1265 -134.8365 -136.9293
quadrupole: 1.5846 -4.4785 5.0383
quadrupole: 1.1709 0.4609 -1.6318 1.5846 -4.4785 5.0383
hfenergy: -929.221699 hartree
pointgroup: C01 [X(C20H30O2)]
dipole: 0.0585721 0.2639352 0.5181194 debye
polarizability: 238.9999916|24.5469806|248.4492963|1.2804552|-6.3383218|194.176737 unknown
InChI: InChI=1S/C20H30O2/c1-2-3-4-5-6-7-8-9-10-11-12-13-14-15-16-17-18-19-20(21)22/h3-4,6-7,9-10,12-13,15-16,21H,2,5,8,11,14,17-19H2,1H3
charge 0 multiplicity 1
52 atoms
O  -1.127459 0.270188 -2.92124
O  -1.350722 -1.920485 -3.645574
C  -0.620491 -2.978429 -1.038891
C  0.027544 -3.334613 0.328145
C  -0.589741 -1.464752 -1.327248
C  1.503249 -2.990716 0.377449
C  3.562676 -1.781161 1.288646
C  2.091869 -2.175188 1.290515
C  3.71347 -0.265852 1.244718
C  4.054533 1.96817 0.055612
C  -1.055951 -1.125995 -2.72551
C  4.030064 0.447727 0.13435
C  0.651463 3.817437 -0.857372
C  2.824194 2.489404 -0.676142
C  -2.71677 2.322931 0.63698
C  1.923237 3.361633 -0.155314
C  -0.583184 3.564815 -0.002456
C  -1.511453 2.603908 -0.249726
C  -2.624182 0.960266 1.308779
C  -3.418246 -1.415104 1.813354
C  -3.506944 -0.059925 1.139899
C  -4.673874 -1.74109 2.662294
H  -0.094263 -3.516396 -1.850439
H  -1.66645 -3.339112 -1.059143
H  -0.506724 -2.813944 1.147534
H  -0.108711 -4.422801 0.497172
H  0.436676 -1.065585 -1.199739
H  -1.213298 -0.900062 -0.606494
H  2.125163 -3.434799 -0.417785
H  4.05636 -2.174474 2.201836
H  4.069194 -2.241752 0.419706
H  1.471972 -1.721891 2.080498
H  3.486091 0.274182 2.177562
H  4.972916 2.294827 -0.475899
H  4.093478 2.402595 1.072201
H  4.232307 -0.091709 -0.805033
H  0.554352 3.291553 -1.825429
H  0.721329 4.903825 -1.079637
H  2.652067 2.081975 -1.684917
H  -2.787302 3.11439 1.410901
H  -3.6489 2.366812 0.038526
H  2.085755 3.757529 0.859989
H  -0.695603 4.202122 0.890287
H  -1.390835 1.947222 -1.12466
H  -1.754298 0.815376 1.969036
H  -3.299538 -2.206541 1.042416
H  -2.514488 -1.454548 2.452422
H  -4.373009 0.092351 0.474327
H  -5.588485 -1.719045 2.040693
H  -4.800498 -1.002709 3.474274
H  -4.596698 -2.746246 3.116252
H  -1.42934 0.445584 -3.854326
