program: Gaussian 09
title: 000030019
version: EM64L-G09RevD.01
frameworkgroup: C1[X(C12H18N2O3)]
method: RPBEPBE
basis: SDD
operation: Freq
keyword: #p
keyword: freq=noraman
keyword: PBEPBE/SDD
title: #p freq=noraman PBEPBE/SDD
converged: YES YES NO NO
title: Mulliken charges:
elementType: O O O N N C C C C C C C C C C C C H H H H H H H H H H H H H H H H H H
charge: -0.218102 -0.212670 -0.221249 -0.380462 -0.372026 0.081517 -0.058139 -0.390770 -0.538014 -0.742977 0.186004 0.151980 -0.380759 -0.058446 0.142237 -0.695260 -0.587116 0.213754 0.247992 0.202229 0.223808 0.247182 0.223994 0.227578 0.240595 0.198202 0.198548 0.364900 0.362858 0.250631 0.212166 0.216712 0.219150 0.215912 0.228037
chargesum: 0.00000
title: Mulliken charges with hydrogens summed into heavy atoms:
elementType: O O O N N C C C C C C C C C C C C
charge: -0.218102 -0.212670 -0.221249 -0.015562 -0.009167 0.081517 0.155615 0.059452 -0.067024 -0.050810 0.186004 0.151980 0.015992 0.192185 0.142237 -0.047232 -0.143166
polarizability: 1.56036804e+02 -8.84646314e+00 1.51307434e+02 1.47792862e+00 -3.54955501e+00 1.43979814e+02
1716.lowfreq: -14.9255 -8.0926 0.0004 0.0006 0.0007 9.5111 34.2937 47.8225 56.9023
frequency: 34.2374 47.7945 56.8813 68.9951 71.3636 92.5552 123.4274 148.3372 163.5618 167.0496 191.9129 202.1400 208.5728 235.6866 256.9360 285.9006 316.2597 353.8404 359.1928 377.5633 399.5584 428.4885 456.1206 488.4622 524.9723 597.7283 625.7573 633.5429 651.0916 673.4811 696.4868 740.2698 750.8967 771.9929 780.8124 840.1971 851.4539 872.4792 895.6480 931.5110 952.1570 954.8500 980.6614 992.9398 1004.9406 1013.6076 1020.8961 1059.5695 1077.0986 1121.0396 1127.1884 1149.7139 1168.6557 1192.5433 1236.5249 1270.6498 1279.2713 1287.5787 1293.8624 1301.9826 1317.9989 1324.3314 1325.5400 1356.4830 1363.2119 1374.3406 1374.5916 1389.9493 1396.9310 1422.7193 1450.1311 1465.9811 1470.3210 1475.5763 1479.4141 1480.9623 1490.9885 1614.1863 1649.5637 1657.2091 1676.2414 2957.5505 2967.8085 2975.5303 2982.7902 2996.0883 3013.9195 3019.9055 3048.7474 3072.5170 3076.3924 3087.1628 3087.7467 3091.9234 3096.3232 3114.9934 3198.8997 3519.8383 3522.4077
redmass: 5.1962 3.9143 1.7825 2.9127 3.2417 3.6921 2.8508 5.1233 5.4136 3.1533 3.3818 3.2674 1.2069 1.3212 3.7435 3.1506 2.9836 5.6898 7.7668 3.0953 2.7203 2.4507 2.7396 7.8392 3.9405 3.9852 3.6521 2.9471 2.4058 2.3692 5.4521 1.1239 1.8466 3.3329 1.6901 2.1385 1.5354 1.7420 2.6894 2.0045 1.4451 1.9377 1.7488 3.1556 1.5711 1.7547 1.3532 2.6796 2.3969 2.2158 3.1575 2.8503 2.0562 3.9700 1.3602 1.3434 1.3960 1.3171 1.5961 1.3665 1.3877 1.4589 1.3388 1.4188 7.6200 2.1586 1.4520 1.2102 1.1961 1.1573 1.1105 1.0625 1.0604 1.0423 1.0607 1.0486 1.0843 6.9095 8.4115 4.7058 5.6177 1.0817 1.0591 1.0368 1.0621 1.0361 1.0984 1.0608 1.1018 1.1006 1.0997 1.0825 1.0842 1.0890 1.0994 1.0956 1.1148 1.0762 1.0778
irintensity: 0.0830 0.1185 0.0503 0.5183 0.0552 0.1751 0.5670 1.4081 8.8166 3.0358 0.2192 0.1572 0.1601 0.0383 1.5573 1.1272 1.3266 17.4916 15.3478 2.7970 2.0110 4.6205 2.7152 12.5997 22.1646 8.5328 10.4331 16.8895 2.7842 30.3986 1.6319 5.6225 9.1671 3.8315 196.7476 9.7762 0.0102 4.3113 8.7425 4.3766 59.4905 27.6655 1.1065 7.0812 6.8151 9.1719 23.3801 5.5711 6.8340 13.2692 49.6747 7.1378 2.6244 29.6194 1.5007 18.3067 63.0923 21.3763 124.3246 36.4323 25.6601 57.2099 12.6854 24.4731 202.6516 4.1063 13.0096 10.8081 20.2138 6.8104 20.0956 6.9188 5.8215 13.6971 2.4571 4.9939 21.5951 277.4216 93.9837 18.2519 598.7483 8.7874 15.0347 31.2052 52.7381 16.0709 10.1474 13.3296 10.8938 65.6341 45.0252 9.3423 21.4172 6.6864 26.6010 10.1465 23.7140 79.9012 48.1801
temp: 298.150 k
press: 1.00000 atm
elementType: 8 8 8 7 7 6 6 6 6 6 6 6 6 6 6 6 6 1 1 1 1 1 1 1 1 1 1 1 1 1 1 1 1 1 1
symmnumber: 1
zpe: 755119.4 jmol-1
zpe.correction: 0.287610 hartree
zpe.thermalcorrener: 0.305826 hartree
zpe.thermalcorrenthalpy: 0.306770 hartree
zpe.thermalcorrgfe: 0.240982 hartree
zpe.sumelectzpe: -801.972479 hartree
zpe.sumelectthermal: -801.954263 hartree
zpe.sumelectthermalent: -801.953319 hartree
zpe.sumelectthermalfe: -802.019107 hartree
dipole: -2.0416 -0.3697 0.6138
dipole: 2.1637
quadrupole: -102.3827 -110.2072 -108.0729
quadrupole: 5.2892 -2.2394 -2.9650
quadrupole: 4.5049 -3.3196 -1.1853 5.2892 -2.2394 -2.9650
hfenergy: -802.2600892 hartree
pointgroup: C01 [X(C12H18N2O3)]
dipole: -0.7817127 0.2575754 -0.2173881 debye
polarizability: 158.224373|7.8495077|149.1613189|-2.1265765|-3.4000511|143.9383596 unknown
InChI: InChI=1S/C12H18N2O3/c1-4-6-8(3)12(7-5-2)9(15)13-11(17)14-10(12)16/h5,8,13-14H,2,4,6-7H2,1,3H3
charge 0 multiplicity 1
35 atoms
O  -0.223896 -0.62808 2.177625
O  1.476949 -0.573303 -2.290152
O  2.913534 2.527119 0.849006
N  1.26669 0.9827 1.462562
N  2.064739 1.051043 -0.75646
C  0.076161 -0.387964 -0.265088
C  -1.156032 0.575512 -0.689894
C  -2.472068 0.17713 0.036903
C  -0.286084 -1.896846 -0.423286
C  -1.360894 0.626391 -2.223224
C  0.359919 -0.069958 1.214065
C  1.255155 -0.024151 -1.181026
C  -3.489009 1.341692 0.119758
C  0.887632 -2.83245 -0.19618
C  2.128726 1.597529 0.538126
C  -4.800347 0.920266 0.817214
C  1.01639 -3.648107 0.879919
H  -0.877014 1.5964 -0.349873
H  -2.259626 -0.169388 1.065613
H  -2.93915 -0.675398 -0.496077
H  -0.677658 -2.04594 -1.445986
H  -1.087623 -2.127288 0.296863
H  -2.263793 1.220868 -2.448671
H  -1.506868 -0.382039 -2.648925
H  -0.514025 1.092991 -2.753622
H  -3.720719 1.724031 -0.89407
H  -3.029907 2.185036 0.67534
H  1.369678 1.286275 2.436407
H  2.769735 1.393176 -1.417761
H  1.658187 -2.836586 -0.979995
H  -5.299903 0.102496 0.264476
H  -4.604669 0.559782 1.844312
H  -5.50942 1.765341 0.88371
H  1.8787 -4.315554 0.991568
H  0.267111 -3.662925 1.680823
