program: Gaussian 09
title: 000030211
version: EM64L-G09RevD.01
frameworkgroup: C1[X(C20H29NO)]
method: RPBEPBE
basis: SDD
operation: Freq
keyword: #p
keyword: freq=noraman
keyword: PBEPBE/SDD
title: #p freq=noraman PBEPBE/SDD
converged: YES YES NO NO
title: Mulliken charges:
elementType: O N C C C C C C C C C C C C C C C C C C C C H H H H H H H H H H H H H H H H H H H H H H H H H H H H H
charge: -0.294184 -0.637123 0.205341 -0.440806 -0.452748 0.258009 -0.505418 0.202804 -0.766834 -0.749328 -0.343204 -0.842496 -0.338636 0.397133 -0.832754 -0.353784 -0.192397 -0.301823 0.411256 -0.833220 -0.441433 0.211582 0.201123 0.199529 0.207160 0.206638 0.217715 0.217657 0.220247 0.225794 0.205799 0.210856 0.230064 0.223742 0.224285 0.224818 0.259383 0.223040 0.237253 0.232442 0.235692 0.225265 0.215671 0.210731 0.214214 0.309545 0.218809 0.224845 0.184794 0.329579 0.303371
chargesum: 0.00000
title: Mulliken charges with hydrogens summed into heavy atoms:
elementType: O N C C C C C C C C C C C C C C C C C C C C
charge: -0.294184 -0.004173 0.205341 -0.040155 -0.038949 0.258009 -0.070046 0.202804 -0.114993 -0.084667 -0.118919 -0.135255 -0.101383 0.397133 -0.139354 -0.138113 0.018333 -0.087608 0.411256 -0.080021 -0.256640 0.211582
polarizability: 6.59256133e+02 -7.33781645e+00 2.31185079e+02 -1.56475802e+01 -1.21774437e+01 1.55260245e+02
1716.lowfreq: -9.4028 -2.4686 -0.0004 0.0002 0.0010 5.2754 9.0781 19.8327 30.2010
frequency: 8.7544 19.7833 30.1083 41.4955 53.5130 65.6088 76.1965 95.4439 105.7874 122.2278 133.1264 151.6608 159.2099 169.4292 191.8747 210.0882 219.4251 233.3408 252.3008 255.8467 270.6781 287.0422 287.4821 310.2512 319.4547 343.8543 363.0401 366.5907 369.7645 393.1416 415.4725 443.3120 450.9550 465.4519 480.4858 484.5647 522.0747 529.1275 545.5697 550.9509 566.5698 593.2486 652.4185 659.1093 700.8575 719.8933 789.9537 826.7089 840.9713 843.4234 852.9689 860.3835 876.6879 881.5306 899.5047 907.5564 929.0233 940.1520 964.5360 976.3456 983.6245 984.6394 989.7457 1006.1561 1007.8036 1018.0710 1032.0002 1036.9933 1037.1846 1047.8977 1048.4586 1083.8875 1124.7893 1139.4520 1171.3766 1187.5106 1196.0914 1200.5282 1209.3982 1212.1905 1224.3381 1262.8412 1268.1267 1277.4010 1300.4701 1304.0044 1318.8940 1333.4209 1342.7557 1344.1109 1356.4231 1375.8394 1376.3301 1386.5883 1390.2652 1394.2301 1395.0365 1404.8303 1447.1813 1449.2389 1458.7201 1464.6669 1466.1499 1470.9455 1471.7697 1474.1514 1475.9066 1476.5792 1486.3013 1491.9734 1492.1880 1549.3845 1570.9820 1578.8916 1604.9586 1617.0496 1621.7183 1635.4330 2935.3557 2955.2873 2964.4633 2968.4914 2969.5532 2973.8973 2978.5278 2979.9077 2995.3690 3022.8118 3025.9956 3042.0404 3046.1733 3049.2783 3062.4636 3066.4812 3073.1094 3076.2766 3077.2997 3080.5605 3088.5978 3091.7790 3103.9849 3104.5643 3113.8119 3116.5217 3122.6271 3523.7404 3682.2926
redmass: 3.5532 4.6196 4.7172 4.2440 3.2481 3.7547 3.6642 3.4918 1.0218 2.7034 2.2293 1.6695 1.7631 3.9789 2.2936 2.0215 1.8001 1.8023 1.4440 1.4018 1.7476 1.9704 3.0811 2.4444 3.0892 2.8709 2.2578 2.3304 3.0589 2.6497 2.7461 4.1672 1.1744 3.1247 3.2352 2.5759 2.9074 2.4019 2.3597 1.3880 2.4605 3.2972 3.8853 3.9570 3.4339 2.8890 2.5974 3.4487 1.6466 1.6034 2.7633 1.8730 1.9092 2.1940 2.0210 1.7384 1.5377 1.9701 1.1348 1.3868 1.3711 1.9634 1.5976 1.3283 1.6034 1.7243 1.8609 1.7445 1.7461 1.6333 1.5371 1.6070 1.5933 2.9507 2.2157 2.8646 2.3767 1.9884 2.1278 2.0943 1.4046 1.5957 1.4614 1.4656 2.5919 1.4223 1.6043 2.0216 1.4410 1.6522 1.9379 1.5200 1.2253 1.2473 1.2128 1.2307 1.5052 1.6084 1.1073 1.1364 1.0676 1.0627 1.0786 1.0563 1.0673 1.0621 1.1183 1.0782 1.0572 1.0610 1.0505 3.5887 3.6366 3.6699 4.0072 1.7564 5.3074 5.1976 1.0631 1.0401 1.0590 1.0391 1.0357 1.0370 1.0396 1.0820 1.0746 1.0953 1.0982 1.0961 1.1029 1.0969 1.0993 1.0985 1.0997 1.0994 1.0888 1.0891 1.0964 1.0883 1.0919 1.0920 1.0881 1.0855 1.0981 1.0444 1.1044
irintensity: 2.5544 0.1823 1.8210 3.8202 0.8642 4.9790 3.0411 0.5659 0.5400 1.1603 1.2356 0.5736 1.4216 0.6819 1.3816 2.5140 1.9190 0.7259 0.2702 0.0366 2.3104 0.9217 2.8242 1.4493 11.2685 1.1208 1.1415 0.7668 3.6641 6.7516 1.4109 6.3108 167.8070 2.9306 2.1019 4.0374 11.5391 12.3810 38.2656 74.2302 2.2523 5.3735 6.7499 15.3394 12.6523 7.4847 7.7097 1.9962 14.1167 1.8454 1.6064 9.2529 12.3652 4.2679 3.0937 9.8463 0.4886 1.4900 5.6141 43.5732 31.7143 37.3456 15.6265 4.2500 26.1505 14.5078 5.9692 14.4126 18.0508 9.4240 3.8446 2.8319 3.4123 1.1990 44.3224 45.9913 6.8692 16.1199 45.3771 5.4986 4.1769 1.9387 196.6001 54.0303 98.9392 5.1076 14.1481 16.2062 1.9002 1.8522 8.4395 48.1597 37.8582 32.8600 13.0044 15.3541 152.3816 36.4578 51.0242 205.0612 3.4188 9.0260 17.9302 22.8414 13.8908 9.9352 27.2964 10.8383 10.2718 9.4459 23.5187 980.4878 36.5832 2.2028 9.3870 158.4036 70.5807 89.4442 44.4819 54.3431 37.8913 25.3902 25.7197 43.7709 28.5574 19.5355 65.1892 34.3920 72.8704 20.7407 65.3518 17.9851 6.4773 119.8160 32.6507 38.4565 2.8070 22.9800 21.9562 16.4396 6.3017 2.5144 54.5195 35.9666 4.9067 73.4565 26.0426
temp: 298.150 k
press: 1.00000 atm
elementType: 8 7 6 6 6 6 6 6 6 6 6 6 6 6 6 6 6 6 6 6 6 6 1 1 1 1 1 1 1 1 1 1 1 1 1 1 1 1 1 1 1 1 1 1 1 1 1 1 1 1 1
symmnumber: 1
zpe: 1151079.6 jmol-1
zpe.correction: 0.438423 hartree
zpe.thermalcorrener: 0.463713 hartree
zpe.thermalcorrenthalpy: 0.464658 hartree
zpe.thermalcorrgfe: 0.381133 hartree
zpe.sumelectzpe: -907.790580 hartree
zpe.sumelectthermal: -907.765290 hartree
zpe.sumelectthermalent: -907.764346 hartree
zpe.sumelectthermalfe: -907.847871 hartree
dipole: 5.7377 1.9447 -1.6919
dipole: 6.2901
quadrupole: -168.2869 -120.6750 -137.5741
quadrupole: -18.4621 11.2976 -5.5614
quadrupole: -26.1082 21.5036 4.6045 -18.4621 11.2976 -5.5614
hfenergy: -908.2290033 hartree
pointgroup: C01 [X(C20H29N1O1)]
dipole: -2.2605898 -0.6945873 -0.7289962 debye
polarizability: 659.2307897|-10.1143388|228.4467135|14.3558856|18.7537591|158.0239541 unknown
InChI: InChI=1S/C20H29NO/c1-15(8-6-9-16(2)14-19(21)22)11-12-18-17(3)10-7-13-20(18,4)5/h6,8-9,11-12,14H,7,10,13,21H2,1-5H3
charge 0 multiplicity 1
51 atoms
O  8.050168 0.013811 0.30881
N  7.367485 -1.746847 -1.025103
C  -4.795606 -1.055913 0.308821
C  -6.25111 -0.521215 0.163764
C  -6.389634 0.946667 0.599459
C  -3.751987 -0.012751 -0.193875
C  -5.522433 1.822055 -0.320759
C  -4.113127 1.280955 -0.529181
C  -4.711704 -2.373557 -0.5213
C  -4.504176 -1.392989 1.802119
C  -2.371878 -0.520349 -0.296325
C  -3.1860 2.2916 -1.183837
C  -1.200788 0.16735 -0.048063
C  0.146569 -0.380521 -0.159656
C  0.317793 -1.816929 -0.62135
C  1.221401 0.4467 0.163081
C  2.625444 0.125074 0.117524
C  3.619417 1.016431 0.482905
C  5.072647 0.801299 0.472139
C  5.879183 1.855519 1.213127
C  5.648325 -0.271722 -0.184252
C  7.091174 -0.61348 -0.253528
H  -6.925834 -1.174675 0.750883
H  -6.563502 -0.606947 -0.897782
H  -6.062359 1.065768 1.650494
H  -7.446656 1.270766 0.553291
H  -5.446167 2.85473 0.079412
H  -6.014741 1.928586 -1.312927
H  -5.57728 -3.017072 -0.27452
H  -4.739548 -2.165217 -1.606822
H  -3.801557 -2.960399 -0.30195
H  -5.173801 -2.201298 2.15386
H  -3.459431 -1.727976 1.936122
H  -4.654946 -0.511537 2.451311
H  -2.277092 -1.585074 -0.547951
H  -3.750652 2.883282 -1.931136
H  -2.327159 1.819368 -1.687586
H  -2.786996 3.020562 -0.449002
H  -1.261538 1.209238 0.293925
H  -0.203581 -2.513447 0.062938
H  -0.118933 -1.96387 -1.62733
H  1.373736 -2.123945 -0.664773
H  0.978852 1.469825 0.491436
H  2.913902 -0.882994 -0.208591
H  3.297767 2.000741 0.85759
H  6.956704 1.646638 1.164942
H  5.677214 2.854592 0.778876
H  5.564291 1.898277 2.273875
H  4.98413 -0.951525 -0.736753
H  8.34093 -2.034987 -1.113224
H  6.643686 -2.2786 -1.50403
