program: Orca
programVersion: 4.2.1
elementType: O O O O N N N C C C C C C C C C C C C C C C C C C H H H H H H H H H H H H H H H H H H H H H H H
charge: 0
multiplicity: 1
keywords: wb97x-d3
keywords: def2-TZVPP
keywords: def2/J RIJCOSX GRIDX6 NOFINALGRIDX
keywords: grid4 nofinalgrid
keywords: scfconv7
keywords: smallprint printgap noloewdin
keywords: NOSOSCF
formula: C18H23N3O4
InChI: InChI=1S/C18H23N3O4/c1-3-5-6-11-25-17(22)16(4-2)21(13-15-8-7-12-24-15)18(23)20-10-9-19-14-20/h3,7-10,12,14,16H,1,4-6,11,13H2,2H3
48 atoms
O  0.216337 -0.693107 0.7085
O  -3.569404 0.236784 0.056234
O  -1.394371 -0.540981 2.250192
O  0.428132 1.042687 -2.161895
N  -0.543763 1.758036 -0.226687
N  1.790277 1.691007 -0.477923
N  3.922652 1.315686 -0.072981
C  -0.509564 1.473497 1.212559
C  -1.5043 2.294163 2.02001
C  -1.862191 1.703866 -0.861868
C  -0.649862 -0.031103 1.452027
C  0.510268 1.451408 -1.024572
C  -1.296894 3.79167 1.862868
C  -2.519373 0.368342 -0.794126
C  0.22676 -2.126143 0.757238
C  1.229775 -2.605552 -0.267286
C  -2.275284 -0.821888 -1.397405
C  1.284683 -4.132079 -0.307081
C  2.21941 2.723296 0.329343
C  2.865389 0.881394 -0.689344
C  -3.230071 -1.74443 -0.876363
C  -3.985148 -1.045099 0.001718
C  3.532299 2.472267 0.558002
C  2.246312 -4.626169 -1.339142
C  3.31826 -5.36785 -1.087339
H  0.481496 1.725026 1.595307
H  -2.53439 2.025162 1.783749
H  -1.358195 2.024552 3.066578
H  -1.752004 2.020052 -1.896274
H  -2.498605 2.450775 -0.388859
H  -1.986593 4.335495 2.507537
H  -0.285554 4.087127 2.146939
H  -1.469908 4.135828 0.842741
H  -0.772949 -2.506971 0.535041
H  0.502382 -2.455534 1.761695
H  2.220628 -2.211596 -0.025673
H  0.958722 -2.218415 -1.254183
H  -1.501778 -1.021779 -2.120715
H  0.285146 -4.518171 -0.5333
H  1.559131 -4.522289 0.676366
H  1.587007 3.544765 0.620072
H  2.805146 -0.011077 -1.291175
H  -3.337485 -2.787399 -1.125812
H  -4.822622 -1.309572 0.626726
H  4.221364 3.065965 1.136303
H  2.034346 -4.335684 -2.364893
H  3.979403 -5.695319 -1.879474
H  3.570864 -5.684207 -0.08151
elementType: O N C H
totalener: -1165.01584359 hartree
nucrepener: 2373.39956540 hartree
electener: -3538.41540899 hartree
oneelecener: -6303.15906588 hartree
twoeener: 2764.74365689 hartree
cpcmener: -0.04100254 hartree
kineticenergy: 1160.03641055 hartree
xcener: -111.462841529849 hartree
chargesum: 0.0000000
charge: -0.254624 -0.276043 -0.437497 -0.465183 -0.128099 -0.003976 -0.390443 0.047156 -0.083444 -0.061927 0.322174 0.381788 -0.287710 0.193417 -0.049764 -0.109582 -0.265054 -0.043166 -0.175784 0.066072 -0.184884 -0.037564 -0.113124 -0.223499 -0.290156 0.144232 0.078471 0.087346 0.129732 0.134231 0.107134 0.083407 0.087399 0.109362 0.129680 0.083352 0.080362 0.161967 0.089013 0.073119 0.210208 0.168061 0.179355 0.178500 0.172057 0.138796 0.131297 0.113835
qa: -0.2546 -0.2760 -0.4375 -0.4652 -0.1281 -0.0040 -0.3904 0.0472 -0.0834 -0.0619 0.3222 0.3818 -0.2877 0.1934 -0.0498 -0.1096 -0.2651 -0.0432 -0.1758 0.0661 -0.1849 -0.0376 -0.1131 -0.2235 -0.2902 0.1442 0.0785 0.0873 0.1297 0.1342 0.1071 0.0834 0.0874 0.1094 0.1297 0.0834 0.0804 0.1620 0.0890 0.0731 0.2102 0.1681 0.1794 0.1785 0.1721 0.1388 0.1313 0.1138
va: 2.1492 2.2716 2.0623 2.0289 3.0487 3.2612 3.1097 3.9207 3.8687 3.8851 4.2523 4.2508 3.9476 3.3874 3.8772 3.8829 3.9126 3.8743 3.9187 4.0364 3.8802 3.8851 4.0521 3.8177 3.9419 0.9915 1.0197 1.0162 1.0152 1.0013 1.0038 1.0018 1.0061 0.9932 1.0033 1.0160 1.0182 1.0126 1.0049 1.0169 0.9770 1.0010 0.9899 0.9880 0.9998 0.9994 1.0025 1.0112
dispcorr: -0.029321461 hartree
energy: -1165.045165055497
dipole: 1.70838 -3.13804 -1.42966 -8.81154 9.29118 0.47964 3.96994 -3.28793 0.68201
magnitude: 1.65503 au
magnitude: 4.20676 debye
