program: Orca
programVersion: 4.2.1
elementType: O O O O N N N C C C C C C C C C C C C C C C C C C H H H H H H H H H H H H H H H H H H H H H H H
charge: 0
multiplicity: 1
keywords: wb97x-d3
keywords: def2-TZVPP
keywords: def2/J RIJCOSX GRIDX6 NOFINALGRIDX
keywords: grid4 nofinalgrid
keywords: scfconv7
keywords: smallprint printgap noloewdin
keywords: NOSOSCF
formula: C18H23N3O4
InChI: InChI=1S/C18H23N3O4/c1-3-5-6-11-25-17(22)16(4-2)21(13-15-8-7-12-24-15)18(23)20-10-9-19-14-20/h3,7-10,12,14,16H,1,4-6,11,13H2,2H3
48 atoms
O  0.728199 -2.222536 0.493295
O  -1.766621 0.491666 -1.461484
O  0.705954 -1.101648 -1.434185
O  2.443344 1.393186 -1.559822
N  0.808901 1.289866 0.018163
N  0.977951 3.1150 -1.450232
N  0.393893 5.239046 -1.435907
C  1.368738 0.060527 0.57065
C  1.180327 -0.046941 2.082889
C  -0.590119 1.570852 0.360231
C  0.875302 -1.13952 -0.240545
C  1.464528 1.855933 -1.016058
C  1.743335 1.153098 2.827816
C  -1.516099 0.521987 -0.131293
C  0.255115 -3.419015 -0.147311
C  -0.046109 -4.433142 0.930733
C  -2.169992 -0.493347 0.483128
C  -1.164505 -4.004185 1.881843
C  0.90964 3.507679 -2.767543
C  0.666175 4.207625 -0.695002
C  -2.862708 -1.204562 -0.542405
C  -2.572727 -0.565432 -1.698291
C  0.530408 4.809394 -2.732953
C  -1.495887 -5.080405 2.864905
C  -1.381024 -4.968276 4.1830
H  2.447507 0.092006 0.391953
H  0.134376 -0.208391 2.351869
H  1.71138 -0.940179 2.41049
H  -0.889704 2.53679 -0.035857
H  -0.688457 1.650421 1.441222
H  1.69391 0.983672 3.902949
H  2.789064 1.323423 2.567748
H  1.198679 2.075236 2.621909
H  1.021353 -3.792008 -0.829772
H  -0.641363 -3.192769 -0.729131
H  0.862016 -4.659412 1.495606
H  -0.331276 -5.357919 0.422536
H  -2.157076 -0.714238 1.53849
H  -2.056453 -3.769015 1.290367
H  -0.88563 -3.091276 2.412966
H  1.107396 2.834622 -3.583928
H  0.695849 4.198269 0.383393
H  -3.489312 -2.074054 -0.430438
H  -2.866695 -0.730121 -2.722333
H  0.345532 5.462598 -3.569981
H  -1.839688 -6.021502 2.44282
H  -1.627026 -5.788031 4.845941
H  -1.03551 -4.05261 4.649833
elementType: O N C H
totalener: -1165.01659862 hartree
nucrepener: 2332.72960546 hartree
electener: -3497.74620409 hartree
oneelecener: -6222.12610223 hartree
twoeener: 2724.37989815 hartree
cpcmener: -0.04973274 hartree
kineticenergy: 1160.03685789 hartree
xcener: -111.464491469639 hartree
chargesum: -0.0000000
charge: -0.258216 -0.285602 -0.445016 -0.479191 -0.128638 -0.036531 -0.386866 0.143247 -0.093417 -0.110967 0.296582 0.416800 -0.290704 0.219891 -0.040707 -0.104263 -0.264258 -0.016907 -0.136355 0.034604 -0.213499 -0.022355 -0.117924 -0.222290 -0.289892 0.111710 0.075852 0.085226 0.155744 0.144770 0.103277 0.093719 0.077517 0.127503 0.108134 0.077828 0.082295 0.164730 0.077056 0.064161 0.187103 0.184817 0.176406 0.181252 0.171257 0.137967 0.131574 0.112581
qa: -0.2582 -0.2856 -0.4450 -0.4792 -0.1286 -0.0365 -0.3869 0.1432 -0.0934 -0.1110 0.2966 0.4168 -0.2907 0.2199 -0.0407 -0.1043 -0.2643 -0.0169 -0.1364 0.0346 -0.2135 -0.0224 -0.1179 -0.2223 -0.2899 0.1117 0.0759 0.0852 0.1557 0.1448 0.1033 0.0937 0.0775 0.1275 0.1081 0.0778 0.0823 0.1647 0.0771 0.0642 0.1871 0.1848 0.1764 0.1813 0.1713 0.1380 0.1316 0.1126
va: 2.1427 2.2679 2.0537 2.0243 3.1102 3.2795 3.1044 3.8027 3.8892 3.9179 4.2719 4.2249 3.9626 3.4214 3.8715 3.9068 3.9128 3.8287 3.9399 4.0315 3.8803 3.8856 4.0270 3.8423 3.9380 1.0255 1.0087 1.0177 1.0032 0.9913 1.0038 1.0003 1.0058 1.0036 1.0012 1.0193 1.0170 1.0002 1.0078 1.0213 0.9948 0.9884 0.9914 0.9872 0.9979 0.9997 1.0026 1.0110
dispcorr: -0.027974032 hartree
energy: -1165.044572656172
dipole: -4.30879 2.95315 -1.35565 -21.54912 19.21451 -2.33462 22.09890 -19.78694 2.31196
magnitude: 3.55434 au
magnitude: 9.03442 debye
