program: Orca
programVersion: 4.2.1
elementType: O O O O N N N C C C C C C C C C C C C C C C C C C H H H H H H H H H H H H H H H H H H H H H H H
charge: 0
multiplicity: 1
keywords: wb97x-d3
keywords: def2-TZVPP
keywords: def2/J RIJCOSX GRIDX6 NOFINALGRIDX
keywords: grid4 nofinalgrid
keywords: scfconv7
keywords: smallprint printgap noloewdin
keywords: NOSOSCF
formula: C18H23N3O4
InChI: InChI=1S/C18H23N3O4/c1-3-5-6-11-25-17(22)16(4-2)21(13-15-8-7-12-24-15)18(23)20-10-9-19-14-20/h3,7-10,12,14,16H,1,4-6,11,13H2,2H3
48 atoms
O  1.20724 -1.600821 -0.179457
O  -2.382374 2.423018 0.760968
O  0.220444 -2.599771 -1.926623
O  1.267507 0.597141 -2.135536
N  -0.226881 0.603785 -0.443467
N  1.299745 2.378417 -0.736997
N  1.430242 4.505108 -0.174516
C  -0.791047 -0.635666 -0.966708
C  -1.61972 -0.462925 -2.237671
C  -0.501135 0.889554 0.967289
C  0.276131 -1.716275 -1.108117
C  0.784769 1.131404 -1.156647
C  -2.744509 0.546951 -2.079608
C  -1.921418 1.234806 1.216206
C  2.30732 -2.526034 -0.127358
C  2.216543 -3.394988 1.106915
C  -2.926328 0.555383 1.818871
C  1.012898 -4.323341 1.122521
C  2.627193 2.731989 -0.851917
C  0.627602 3.497719 -0.335793
C  -4.086757 1.382414 1.723956
C  -3.695729 2.498313 1.0690
C  2.683737 4.034535 -0.482439
C  0.950479 -5.257746 2.289866
C  1.825678 -5.346002 3.285612
H  -1.47619 -1.005169 -0.195564
H  -0.984731 -0.187222 -3.079727
H  -2.047193 -1.436625 -2.478596
H  0.165769 1.670014 1.328935
H  -0.262763 0.000506 1.554561
H  -3.351465 0.570841 -2.984591
H  -3.405182 0.290512 -1.249274
H  -2.372162 1.557512 -1.915548
H  3.206733 -1.912129 -0.091766
H  2.344858 -3.129384 -1.034084
H  2.22403 -2.764989 2.000322
H  3.138811 -3.981477 1.136367
H  -2.851455 -0.419546 2.273624
H  0.989973 -4.918369 0.202909
H  0.082978 -3.744476 1.109478
H  3.389921 2.034394 -1.15211
H  -0.442388 3.527438 -0.21524
H  -5.076613 1.170136 2.093154
H  -4.211506 3.396137 0.769157
H  3.5577 4.661943 -0.417977
H  0.089815 -5.920033 2.299023
H  1.685683 -6.060577 4.086609
H  2.708856 -4.722331 3.3520
elementType: O N C H
totalener: -1165.01752800 hartree
nucrepener: 2300.18112717 hartree
electener: -3465.19865516 hartree
oneelecener: -6156.50735825 hartree
twoeener: 2691.30870308 hartree
cpcmener: -0.04329357 hartree
kineticenergy: 1160.03564571 hartree
xcener: -111.465246910094 hartree
chargesum: 0.0000000
charge: -0.277757 -0.281602 -0.457438 -0.480829 -0.104198 -0.043764 -0.385997 0.052291 -0.114661 -0.098434 0.383312 0.411024 -0.286271 0.210248 -0.022464 -0.074485 -0.278213 -0.031816 -0.130443 0.033071 -0.173253 -0.046876 -0.116936 -0.206060 -0.302943 0.116008 0.087562 0.083765 0.157671 0.139857 0.107516 0.080128 0.085094 0.114050 0.104845 0.073849 0.076384 0.172306 0.078773 0.077578 0.184848 0.186398 0.177583 0.178016 0.170545 0.133093 0.133007 0.105620
qa: -0.2778 -0.2816 -0.4574 -0.4808 -0.1042 -0.0438 -0.3860 0.0523 -0.1147 -0.0984 0.3833 0.4110 -0.2863 0.2102 -0.0225 -0.0745 -0.2782 -0.0318 -0.1304 0.0331 -0.1733 -0.0469 -0.1169 -0.2061 -0.3029 0.1160 0.0876 0.0838 0.1577 0.1399 0.1075 0.0801 0.0851 0.1140 0.1048 0.0738 0.0764 0.1723 0.0788 0.0776 0.1848 0.1864 0.1776 0.1780 0.1705 0.1331 0.1330 0.1056
va: 2.1364 2.2563 2.0526 2.0230 3.0750 3.2972 3.1116 3.9033 3.8782 3.8449 4.1963 4.2201 3.9426 3.3594 3.8769 3.8747 3.9609 3.8434 3.9409 4.0073 3.8893 3.8889 4.0324 3.8529 3.9150 1.0065 1.0187 1.0186 0.9877 1.0133 1.0059 1.0035 1.0068 0.9999 1.0197 1.0107 1.0127 1.0003 1.0096 1.0093 0.9965 1.0123 0.9905 0.9900 0.9983 1.0002 1.0039 1.0136
dispcorr: -0.026471794 hartree
energy: -1165.043999791628
dipole: -2.78817 1.76755 -1.02062 -20.13883 19.09984 -1.03899 7.13340 -4.96060 2.17279
magnitude: 2.61576 au
magnitude: 6.64873 debye
