program: Orca
programVersion: 4.2.1
elementType: O O O O N N N C C C C C C C C C C C C C C C C C C H H H H H H H H H H H H H H H H H H H H H H H
charge: 0
multiplicity: 1
keywords: wb97x-d3
keywords: def2-TZVPP
keywords: def2/J RIJCOSX GRIDX6 NOFINALGRIDX
keywords: grid4 nofinalgrid
keywords: scfconv7
keywords: smallprint printgap noloewdin
keywords: NOSOSCF
formula: C18H23N3O4
InChI: InChI=1S/C18H23N3O4/c1-3-5-6-11-25-17(22)16(4-2)21(13-15-8-7-12-24-15)18(23)20-10-9-19-14-20/h3,7-10,12,14,16H,1,4-6,11,13H2,2H3
48 atoms
O  0.772914 -1.591797 0.673594
O  -2.465654 0.251207 -1.385663
O  0.440377 -0.49352 -1.242534
O  -0.695273 2.713445 -1.868486
N  -0.230335 1.775521 0.158375
N  1.479057 2.555283 -1.243916
N  3.392004 2.553061 -2.333347
C  0.643168 0.780395 0.778558
C  0.424768 0.63364 2.280804
C  -1.661788 1.643318 0.446512
C  0.57575 -0.509426 -0.041849
C  0.093336 2.341032 -1.027911
C  0.597691 1.948825 3.024409
C  -2.242734 0.372762 -0.055469
C  0.807859 -2.861187 -0.004462
C  1.232764 -3.910364 0.995391
C  -2.529181 -0.79879 0.564615
C  0.238517 -4.155309 2.13133
C  2.408641 3.112303 -0.393413
C  2.129894 2.24578 -2.396997
C  -2.945798 -1.706002 -0.455022
C  -2.880326 -1.013721 -1.614268
C  3.574063 3.104538 -1.089511
C  -1.034615 -4.77994 1.658282
C  -2.254194 -4.303477 1.877784
H  1.679232 1.108472 0.665013
H  -0.544893 0.189075 2.510724
H  1.169846 -0.073416 2.644689
H  -2.178454 2.51206 0.042118
H  -1.799881 1.685657 1.525472
H  -0.150019 2.693099 2.748726
H  0.511093 1.786299 4.09844
H  1.582375 2.382545 2.83955
H  1.519371 -2.815454 -0.83097
H  -0.18318 -3.071481 -0.41574
H  2.209346 -3.643334 1.406206
H  1.382391 -4.839024 0.437895
H  -2.446208 -0.995372 1.621285
H  0.029074 -3.228932 2.671181
H  0.715151 -4.8303 2.848816
H  2.156558 3.49185 0.582318
H  1.631183 1.781956 -3.232862
H  -3.243499 -2.734613 -0.336889
H  -3.102584 -1.271265 -2.637239
H  4.532949 3.474971 -0.764926
H  -0.926325 -5.706393 1.098582
H  -3.136579 -4.818304 1.519474
H  -2.417921 -3.38608 2.431864
elementType: O N C H
totalener: -1165.01662066 hartree
nucrepener: 2382.42527236 hartree
electener: -3547.44189302 hartree
oneelecener: -6321.86360054 hartree
twoeener: 2774.42170752 hartree
cpcmener: -0.04878054 hartree
kineticenergy: 1160.03521666 hartree
xcener: -111.464980895896 hartree
chargesum: 0.0000000
charge: -0.253538 -0.280829 -0.453553 -0.463858 -0.121971 -0.015184 -0.388398 0.086866 -0.078282 -0.084941 0.300500 0.378593 -0.291491 0.202182 -0.022993 -0.129034 -0.240560 -0.049947 -0.173999 0.059639 -0.221170 -0.013637 -0.114028 -0.173998 -0.330794 0.143869 0.080246 0.083089 0.128147 0.141262 0.086838 0.106943 0.086336 0.119482 0.110276 0.083128 0.080524 0.162079 0.070364 0.094589 0.201936 0.170653 0.175687 0.181513 0.170796 0.137977 0.138196 0.120496
qa: -0.2535 -0.2808 -0.4536 -0.4639 -0.1220 -0.0152 -0.3884 0.0869 -0.0783 -0.0849 0.3005 0.3786 -0.2915 0.2022 -0.0230 -0.1290 -0.2406 -0.0499 -0.1740 0.0596 -0.2212 -0.0136 -0.1140 -0.1740 -0.3308 0.1439 0.0802 0.0831 0.1281 0.1413 0.0868 0.1069 0.0863 0.1195 0.1103 0.0831 0.0805 0.1621 0.0704 0.0946 0.2019 0.1707 0.1757 0.1815 0.1708 0.1380 0.1382 0.1205
va: 2.1591 2.2795 2.0341 2.0333 3.0483 3.2525 3.1096 3.9199 3.8625 3.9239 4.2007 4.2739 3.9463 3.4921 3.8479 3.9367 3.9006 3.8482 3.9190 4.0336 3.8919 3.8874 4.0498 3.7561 3.9296 0.9863 1.0092 1.0205 1.0247 0.9906 1.0059 1.0029 1.0020 1.0076 0.9980 1.0165 1.0124 1.0008 1.0203 1.0054 0.9809 1.0033 0.9926 0.9864 1.0004 0.9993 0.9996 1.0043
dispcorr: -0.029710954 hartree
energy: -1165.046331617815
dipole: -0.88439 0.58249 -0.30190 -18.72988 16.71019 -2.01969 22.27147 -18.44360 3.82787
magnitude: 4.33854 au
magnitude: 11.02769 debye
