program: Gaussian 09
title: 000030045
version: EM64L-G09RevD.01
frameworkgroup: C1[X(C14H19ClN2O2)]
method: RPBEPBE
basis: SDD
operation: Freq
keyword: #p
keyword: freq=noraman
keyword: PBEPBE/SDD
title: #p freq=noraman PBEPBE/SDD
converged: YES YES NO NO
title: Mulliken charges:
elementType: Cl O O N N C C C C C C C C C C C C C C H H H H H H H H H H H H H H H H H H H
charge: -0.069414 -0.300732 -0.272818 -0.084695 -0.450128 -0.369914 -0.372276 -0.388858 -0.384231 -0.399921 -0.341509 -0.305957 0.260228 0.583798 -0.353153 -0.330705 -0.217955 -0.219756 -0.243662 0.177748 0.222316 0.211306 0.170399 0.193683 0.204424 0.203319 0.192329 0.214652 0.189592 0.220287 0.215858 0.239043 0.239307 0.338342 0.306199 0.254995 0.232255 0.235602
chargesum: 0.00000
title: Mulliken charges with hydrogens summed into heavy atoms:
elementType: Cl O O N N C C C C C C C C C C C C C C
charge: -0.069414 -0.300732 -0.272818 -0.084695 -0.111786 0.030150 0.009429 0.009249 0.011416 0.004323 0.094636 0.172394 0.260228 0.583798 -0.353153 -0.024506 0.037040 0.012499 -0.008060
polarizability: 2.57945788e+02 1.00694475e+01 1.89136666e+02 -1.47376168e+01 -1.99379251e+00 1.09461642e+02
1716.lowfreq: -6.5568 0.0007 0.0014 0.0015 0.9783 4.4967 18.3279 18.6305 23.7357
frequency: 18.2114 18.2940 23.2518 58.7247 76.7912 82.5003 91.7779 127.0459 158.8799 203.0313 210.2770 235.9912 252.0566 278.8401 289.5092 321.6874 352.5896 365.1810 386.5968 404.2724 419.9445 439.5378 450.2417 475.7018 538.9136 563.4371 610.2977 666.1642 674.9714 679.6492 709.0037 729.2643 756.1427 760.5152 794.2289 806.7108 831.9142 850.3341 856.1029 870.8600 899.7470 904.9384 947.6023 956.6161 992.1418 992.2519 995.2398 1013.6042 1042.1026 1046.4858 1051.4904 1068.1907 1101.6021 1114.4821 1127.9895 1131.1514 1149.0879 1160.2016 1172.4697 1173.3176 1199.5645 1244.3859 1256.8768 1263.1085 1267.3219 1292.6409 1297.3710 1309.8779 1320.6218 1331.9207 1339.8932 1347.7796 1355.1667 1371.3245 1375.2283 1394.3323 1430.8977 1450.2348 1451.3444 1456.0075 1459.0198 1464.3681 1469.1312 1477.0098 1482.2379 1519.2976 1578.2243 1616.4345 1658.0441 2827.7144 2838.4055 2902.3941 2967.4689 2985.7348 2986.6420 3024.0548 3032.9340 3037.9010 3039.9531 3045.2644 3046.5799 3055.7307 3128.1006 3142.2676 3159.2567 3176.8730 3187.4256 3501.1666
redmass: 3.7702 4.6638 5.2016 4.3863 6.7051 5.2178 5.0324 3.4318 5.1753 4.0478 3.5860 2.4502 3.3447 4.5293 3.6214 2.5570 4.2862 3.2234 2.5062 3.5442 7.5356 3.4056 2.8881 2.9857 3.5966 2.1204 5.0838 5.2335 2.4086 5.9945 3.4055 2.1025 3.3519 1.2521 1.3711 1.4000 5.2460 1.9558 1.8247 1.3419 6.2228 2.3539 1.3539 1.3078 3.3898 1.3929 3.5537 6.3486 2.0476 2.1135 1.8465 3.3119 1.7354 2.2223 1.5949 1.7741 1.3345 2.3540 1.6372 1.5933 1.3734 1.6238 1.3619 1.3474 1.2384 1.2534 1.2816 1.7191 1.3114 1.3146 1.4224 1.4759 1.3921 1.7055 3.3862 1.4139 2.5993 1.1116 1.0924 2.1506 1.0893 1.0892 1.0886 1.0866 1.0944 2.5916 5.2264 6.6865 7.7915 1.0716 1.0704 1.0692 1.0625 1.0612 1.0615 1.0882 1.0931 1.0852 1.0832 1.0742 1.1013 1.1036 1.1077 1.0866 1.0917 1.0973 1.0964 1.0759
irintensity: 0.0289 0.1601 0.2803 1.7937 3.0024 0.7652 0.6610 1.1617 0.0157 0.9191 6.1007 0.3263 0.5858 3.1736 13.4481 7.9381 7.9329 19.2053 3.7714 4.5952 4.2344 10.7078 0.4414 4.5423 4.5987 1.4012 0.1219 20.0181 6.4865 9.8713 27.0458 38.1554 3.5590 130.3409 1.2042 0.2132 17.2008 2.0368 12.6572 3.9817 8.7510 4.1106 5.2916 2.4982 68.7889 8.3716 154.5000 117.2471 2.2982 14.7322 74.9716 0.7387 40.9825 9.6883 15.7701 1.5227 6.2169 91.1287 206.9334 182.2221 6.1743 14.8935 3.3852 8.2990 19.9378 3.3401 7.5696 25.8467 9.8923 0.5793 0.5529 1.5924 1.4032 12.3210 110.6791 0.2661 107.6866 12.8820 6.4963 25.5217 12.0778 6.6516 8.7486 3.4767 13.3445 614.0159 18.4755 167.8960 199.2229 57.3508 124.8597 84.5289 38.5007 36.0899 31.8905 47.8846 83.1815 14.0566 18.2454 46.9064 9.9062 100.8900 14.3947 4.2156 11.5469 6.3011 12.2754 65.8694
temp: 298.150 k
press: 1.00000 atm
elementType: 17 8 8 7 7 6 6 6 6 6 6 6 6 6 6 6 6 6 6 1 1 1 1 1 1 1 1 1 1 1 1 1 1 1 1 1 1 1
symmnumber: 1
zpe: 819715.3 jmol-1
zpe.correction: 0.312213 hartree
zpe.thermalcorrener: 0.330527 hartree
zpe.thermalcorrenthalpy: 0.331471 hartree
zpe.thermalcorrgfe: 0.262383 hartree
zpe.sumelectzpe: -1263.466224 hartree
zpe.sumelectthermal: -1263.447910 hartree
zpe.sumelectthermalent: -1263.446966 hartree
zpe.sumelectthermalfe: -1263.516053 hartree
dipole: -0.5958 0.1143 -0.9351
dipole: 1.1147
quadrupole: -103.7277 -117.5770 -122.7228
quadrupole: 6.4428 -0.0890 -0.7366
quadrupole: 10.9482 -2.9012 -8.0469 6.4428 -0.0890 -0.7366
hfenergy: -1263.7784367 hartree
pointgroup: C01 [X(C14H19Cl1N2O2)]
dipole: -0.228235 0.1276596 0.3520405 debye
polarizability: 259.1633067|1.7015916|168.6148898|14.692791|-34.0652837|128.7658996 unknown
InChI: InChI=1S/C14H19ClN2O2/c15-12-6-2-3-7-13(12)16-14(18)19-11-10-17-8-4-1-5-9-17/h2-3,6-7,16H,1,4-5,8-11H2
charge 0 multiplicity 1
38 atoms
Cl 4.260746 2.359601 -1.310032
O  -0.210569 0.753169 -1.424728
O  0.352476 -1.142055 -0.138656
N  -3.766787 0.332439 -0.206649
N  1.930635 0.518072 -0.76519
C  -3.859551 -0.984076 0.47891
C  -4.785643 1.285478 0.301256
C  -5.250577 -1.615838 0.274412
C  -6.208394 0.725226 0.092455
C  -6.359499 -0.657923 0.767416
C  -2.389489 0.873149 -0.221308
C  -1.632084 0.308274 -1.438395
C  0.6747 -0.068518 -0.707691
C  3.13021 0.032448 -0.199682
C  4.325839 0.784128 -0.365166
C  3.21484 -1.182355 0.536456
C  5.558222 0.371699 0.163353
C  4.448926 -1.604361 1.071243
C  5.623123 -0.838607 0.891654
H  -3.666583 -0.869233 1.578536
H  -3.072547 -1.651062 0.0833
H  -4.671437 2.242018 -0.242086
H  -4.635636 1.499549 1.392973
H  -5.298623 -2.580608 0.81512
H  -5.392587 -1.826194 -0.803214
H  -6.393575 0.627788 -0.994852
H  -6.948733 1.441721 0.497885
H  -7.360284 -1.081945 0.560684
H  -6.278984 -0.540043 1.868266
H  -1.824197 0.630541 0.709675
H  -2.430105 1.974559 -0.303798
H  -2.04017 0.706942 -2.378789
H  -1.660578 -0.794541 -1.446611
H  1.985392 1.400238 -1.284182
H  2.3058 -1.771816 0.672967
H  6.449642 0.985921 0.007677
H  4.489397 -2.54296 1.633952
H  6.57908 -1.170424 1.30834
