program: Orca
programVersion: 4.2.1
elementType: O O O O N N N C C C C C C C C C C C C C C C C C C H H H H H H H H H H H H H H H H H H H H H H H
charge: 0
multiplicity: 1
keywords: wb97x-d3
keywords: def2-TZVPP
keywords: def2/J RIJCOSX GRIDX6 NOFINALGRIDX
keywords: grid4 nofinalgrid
keywords: scfconv7
keywords: smallprint printgap noloewdin
keywords: NOSOSCF
formula: C18H23N3O4
InChI: InChI=1S/C18H23N3O4/c1-3-5-6-11-25-17(22)16(4-2)21(13-15-8-7-12-24-15)18(23)20-10-9-19-14-20/h3,7-10,12,14,16H,1,4-6,11,13H2,2H3
48 atoms
O  0.044524 -1.755715 0.511293
O  -2.744739 0.325311 -1.704077
O  -0.048149 -0.845105 -1.522014
O  -0.344835 3.889754 -0.740577
N  -0.374058 1.666316 -0.262199
N  1.542877 2.712134 -1.139559
N  3.594282 3.414554 -1.533022
C  0.369269 0.582332 0.373509
C  0.212079 0.584818 1.895797
C  -1.809344 1.729109 0.037362
C  0.067921 -0.742086 -0.324491
C  0.205911 2.808755 -0.691171
C  0.58338 1.929533 2.502602
C  -2.522167 0.499378 -0.37907
C  -0.189307 -3.07199 -0.016799
C  -0.171985 -4.042184 1.140181
C  -3.019289 -0.556133 0.311282
C  1.183545 -4.137148 1.841387
C  2.149625 1.733498 -1.900854
C  2.464524 3.702334 -0.962002
C  -3.57401 -1.446652 -0.65679
C  -3.369695 -0.861214 -1.858923
C  3.405447 2.190898 -2.128764
C  1.183711 -5.183403 2.909072
C  1.436454 -4.960492 4.193409
H  1.433999 0.740314 0.185275
H  -0.79669 0.297831 2.198698
H  0.878935 -0.178911 2.296035
H  -2.228901 2.592428 -0.475694
H  -1.975758 1.888976 1.104484
H  0.589666 1.861479 3.590269
H  1.580513 2.249097 2.190861
H  -0.118107 2.72274 2.238926
H  0.585579 -3.31887 -0.746341
H  -1.156128 -3.089014 -0.524043
H  -0.444333 -5.020259 0.735171
H  -0.95235 -3.777458 1.858639
H  -2.992221 -0.6887 1.381139
H  1.463449 -3.172288 2.270597
H  1.944915 -4.385562 1.093694
H  1.637485 0.848133 -2.236168
H  2.252065 4.592069 -0.391055
H  -4.055483 -2.394017 -0.47729
H  -3.616754 -1.149955 -2.868001
H  4.183554 1.709317 -2.698482
H  0.947317 -6.194035 2.585248
H  1.416236 -5.760522 4.922507
H  1.674446 -3.970181 4.565478
elementType: O N C H
totalener: -1165.01790013 hartree
nucrepener: 2316.21551116 hartree
electener: -3481.23341129 hartree
oneelecener: -6188.52878416 hartree
twoeener: 2707.29537288 hartree
cpcmener: -0.04447518 hartree
kineticenergy: 1160.01799987 hartree
xcener: -111.461589671471 hartree
chargesum: -0.0000000
charge: -0.253705 -0.285729 -0.466531 -0.481408 -0.097236 -0.024664 -0.387711 0.012655 -0.095402 -0.091915 0.382787 0.382970 -0.291176 0.190315 -0.035198 -0.114196 -0.232767 -0.023273 -0.181882 0.070066 -0.219873 -0.013993 -0.111157 -0.220841 -0.292106 0.139109 0.086310 0.084545 0.130090 0.144475 0.110820 0.091366 0.081193 0.115852 0.124524 0.083288 0.077950 0.164896 0.069958 0.081533 0.207956 0.172535 0.179383 0.181581 0.172128 0.138300 0.130969 0.113206
qa: -0.2537 -0.2857 -0.4665 -0.4814 -0.0972 -0.0247 -0.3877 0.0127 -0.0954 -0.0919 0.3828 0.3830 -0.2912 0.1903 -0.0352 -0.1142 -0.2328 -0.0233 -0.1819 0.0701 -0.2199 -0.0140 -0.1112 -0.2208 -0.2921 0.1391 0.0863 0.0845 0.1301 0.1445 0.1108 0.0914 0.0812 0.1159 0.1245 0.0833 0.0779 0.1649 0.0700 0.0815 0.2080 0.1725 0.1794 0.1816 0.1721 0.1383 0.1310 0.1132
va: 2.1598 2.2693 2.0165 2.0203 3.0762 3.2628 3.1150 3.9437 3.8995 3.9123 4.1367 4.2464 3.9467 3.4847 3.8551 3.9280 3.8848 3.8226 3.9137 4.0209 3.8887 3.8663 4.0557 3.8170 3.9404 0.9862 1.0090 1.0163 1.0278 0.9936 1.0037 1.0019 1.0087 1.0032 1.0043 1.0169 1.0194 1.0011 1.0233 1.0080 1.0004 1.0009 0.9896 0.9865 1.0002 0.9998 1.0026 1.0109
dispcorr: -0.027408175 hartree
energy: -1165.045308303904
dipole: 1.91997 -3.19065 -1.27068 -22.08473 18.86486 -3.21986 21.19206 -19.11240 2.07966
magnitude: 4.03821 au
magnitude: 10.26431 debye
