program: Orca
programVersion: 4.2.1
elementType: O O O O N N N C C C C C C C C C C C C C C C C C C H H H H H H H H H H H H H H H H H H H H H H H
charge: 0
multiplicity: 1
keywords: wb97x-d3
keywords: def2-TZVPP
keywords: def2/J RIJCOSX GRIDX6 NOFINALGRIDX
keywords: grid4 nofinalgrid
keywords: scfconv7
keywords: smallprint printgap noloewdin
keywords: NOSOSCF
formula: C18H23N3O4
InChI: InChI=1S/C18H23N3O4/c1-3-5-6-11-25-17(22)16(4-2)21(13-15-8-7-12-24-15)18(23)20-10-9-19-14-20/h3,7-10,12,14,16H,1,4-6,11,13H2,2H3
48 atoms
O  -0.316891 -1.210195 0.090683
O  -2.378015 -0.069845 -1.934893
O  -1.113425 -1.018878 2.171268
O  -0.068247 3.122941 -1.719981
N  -0.570657 1.542033 -0.158912
N  1.642393 1.928596 -0.841991
N  3.809422 2.299509 -0.7241
C  -0.164563 0.916444 1.096654
C  -0.585227 1.728801 2.320763
C  -2.009211 1.73137 -0.353289
C  -0.614415 -0.53862 1.18465
C  0.266169 2.25216 -0.94394
C  -0.13678 3.178528 2.225574
C  -2.695385 0.474871 -0.735911
C  -0.573053 -2.626196 0.053034
C  0.476949 -3.430684 0.792485
C  -3.625037 -0.288235 -0.114156
C  1.894736 -3.173285 0.305665
C  2.250291 0.693193 -0.906107
C  2.634883 2.855723 -0.743307
C  -3.898015 -1.383319 -0.990065
C  -3.109057 -1.199895 -2.072376
C  3.581064 0.950763 -0.837713
C  2.948492 -4.035909 0.925407
C  2.770221 -4.967334 1.856267
H  0.926292 0.869891 1.120536
H  -1.662426 1.673935 2.489305
H  -0.119256 1.263222 3.190067
H  -2.162697 2.497901 -1.110247
H  -2.464713 2.112946 0.560961
H  -0.669375 3.73195 1.44961
H  -0.322737 3.692905 3.168114
H  0.933983 3.25758 2.019177
H  -0.566068 -2.872021 -1.007808
H  -1.571647 -2.834369 0.438722
H  0.215763 -4.481014 0.634402
H  0.404835 -3.256853 1.868207
H  -4.061256 -0.097588 0.853209
H  2.17688 -2.129534 0.485066
H  1.943471 -3.29759 -0.782298
H  1.697066 -0.219532 -1.041495
H  2.430128 3.912017 -0.66784
H  -4.585172 -2.197828 -0.828582
H  -2.967313 -1.759607 -2.982814
H  4.388762 0.237639 -0.872253
H  3.955839 -3.855783 0.560763
H  3.607114 -5.538464 2.237383
H  1.798469 -5.209379 2.269422
elementType: O N C H
totalener: -1165.01529601 hartree
nucrepener: 2364.85844664 hartree
electener: -3529.87374265 hartree
oneelecener: -6285.52085117 hartree
twoeener: 2755.64710852 hartree
cpcmener: -0.04253617 hartree
kineticenergy: 1160.02256306 hartree
xcener: -111.464220830813 hartree
chargesum: -0.0000000
charge: -0.262860 -0.290295 -0.442440 -0.471610 -0.098143 -0.025728 -0.386906 0.014006 -0.108127 -0.087737 0.348436 0.367393 -0.282513 0.209546 -0.031088 -0.107071 -0.246900 -0.028041 -0.193580 0.064026 -0.208738 -0.021613 -0.100451 -0.209655 -0.301023 0.145817 0.079080 0.090704 0.136113 0.147381 0.083833 0.109441 0.090170 0.122096 0.126719 0.089116 0.081592 0.165960 0.063633 0.085175 0.210466 0.177575 0.173466 0.179489 0.170761 0.133412 0.133089 0.106023
qa: -0.2629 -0.2903 -0.4424 -0.4716 -0.0981 -0.0257 -0.3869 0.0140 -0.1081 -0.0877 0.3484 0.3674 -0.2825 0.2095 -0.0311 -0.1071 -0.2469 -0.0280 -0.1936 0.0640 -0.2087 -0.0216 -0.1005 -0.2097 -0.3010 0.1458 0.0791 0.0907 0.1361 0.1474 0.0838 0.1094 0.0902 0.1221 0.1267 0.0891 0.0816 0.1660 0.0636 0.0852 0.2105 0.1776 0.1735 0.1795 0.1708 0.1334 0.1331 0.1060
va: 2.1170 2.2530 2.0498 2.0319 3.0645 3.2525 3.1165 3.9256 3.8996 3.9092 4.2669 4.2630 3.9543 3.4649 3.8551 3.9145 3.9190 3.8256 3.9190 4.0160 3.8745 3.8469 4.0534 3.8650 3.9168 0.9742 1.0076 1.0162 1.0280 0.9923 1.0054 1.0057 1.0020 0.9940 1.0049 1.0086 1.0183 1.0027 1.0158 1.0032 0.9898 0.9966 0.9928 0.9883 1.0019 1.0013 1.0042 1.0146
dispcorr: -0.029203753 hartree
energy: -1165.044499760434
dipole: 2.92437 -4.50592 -1.58155 -13.36957 11.63759 -1.73199 12.86981 -12.19880 0.67101
magnitude: 2.43953 au
magnitude: 6.20080 debye
