program: Orca
programVersion: 4.2.1
elementType: O O O O N N N C C C C C C C C C C C C C C C C C C H H H H H H H H H H H H H H H H H H H H H H H
charge: 0
multiplicity: 1
keywords: wb97x-d3
keywords: def2-TZVPP
keywords: def2/J RIJCOSX GRIDX6 NOFINALGRIDX
keywords: grid4 nofinalgrid
keywords: scfconv7
keywords: smallprint printgap noloewdin
keywords: NOSOSCF
formula: C18H23N3O4
InChI: InChI=1S/C18H23N3O4/c1-3-5-6-11-25-17(22)16(4-2)21(13-15-8-7-12-24-15)18(23)20-10-9-19-14-20/h3,7-10,12,14,16H,1,4-6,11,13H2,2H3
48 atoms
O  -0.100948 -1.104352 0.350828
O  -3.775391 0.474193 -0.016509
O  -1.766615 -1.039038 1.84242
O  0.324291 1.196534 -2.127931
N  -0.557364 1.583799 -0.060164
N  1.755161 1.362743 -0.383303
N  3.882026 0.829307 -0.179041
C  -0.552859 0.993202 1.282606
C  -1.417144 1.748488 2.280627
C  -1.871251 1.843367 -0.650371
C  -0.909963 -0.492359 1.19481
C  0.454271 1.349336 -0.933228
C  -1.00319 3.202945 2.434616
C  -2.710782 0.628376 -0.843871
C  -0.277477 -2.5074 0.099839
C  0.94217 -3.00617 -0.637888
C  -2.635959 -0.431407 -1.68722
C  2.216038 -2.98702 0.207661
C  2.266953 2.176524 0.605856
C  2.780592 0.577856 -0.820037
C  -3.718603 -1.295983 -1.348338
C  -4.371447 -0.694897 -0.327165
C  3.574037 1.831008 0.709568
C  3.377466 -3.576484 -0.525631
C  4.498048 -2.930621 -0.826783
H  0.467029 1.017717 1.671747
H  -2.476366 1.677548 2.032397
H  -1.30266 1.244216 3.241099
H  -1.719586 2.355961 -1.597762
H  -2.396857 2.552205 -0.01072
H  -1.609277 3.686532 3.200269
H  0.039887 3.29026 2.743374
H  -1.128149 3.77637 1.515406
H  -1.181459 -2.6454 -0.497083
H  -0.405489 -3.043316 1.042431
H  1.084512 -2.430928 -1.557024
H  0.727394 -4.031714 -0.949428
H  -1.894146 -0.582587 -2.454143
H  2.034202 -3.566879 1.119085
H  2.45552 -1.969638 0.524761
H  1.686922 2.937271 1.099606
H  2.654289 -0.154811 -1.601363
H  -3.974489 -2.237493 -1.806153
H  -5.243294 -0.96171 0.247998
H  4.313668 2.254088 1.370045
H  3.268051 -4.613137 -0.83421
H  5.302158 -3.416167 -1.364776
H  4.657579 -1.896327 -0.542396
elementType: O N C H
totalener: -1165.01584240 hartree
nucrepener: 2401.79750169 hartree
electener: -3566.81334409 hartree
oneelecener: -6360.19305097 hartree
twoeener: 2793.37970687 hartree
cpcmener: -0.03969482 hartree
kineticenergy: 1160.02857569 hartree
xcener: -111.462029637897 hartree
chargesum: -0.0000000
charge: -0.254927 -0.276719 -0.438466 -0.466496 -0.130609 0.009473 -0.388952 0.052399 -0.081611 -0.072036 0.321940 0.383475 -0.292995 0.215775 -0.044308 -0.126993 -0.293047 -0.064976 -0.181116 0.057983 -0.174564 -0.039848 -0.104609 -0.202778 -0.291391 0.143870 0.076341 0.087600 0.128775 0.134062 0.107840 0.085313 0.088329 0.127580 0.113209 0.074938 0.097390 0.161543 0.097057 0.079531 0.216347 0.165537 0.180121 0.178513 0.171480 0.139086 0.130717 0.100216
qa: -0.2549 -0.2767 -0.4385 -0.4665 -0.1306 0.0095 -0.3890 0.0524 -0.0816 -0.0720 0.3219 0.3835 -0.2930 0.2158 -0.0443 -0.1270 -0.2930 -0.0650 -0.1811 0.0580 -0.1746 -0.0398 -0.1046 -0.2028 -0.2914 0.1439 0.0763 0.0876 0.1288 0.1341 0.1078 0.0853 0.0883 0.1276 0.1132 0.0749 0.0974 0.1615 0.0971 0.0795 0.2163 0.1655 0.1801 0.1785 0.1715 0.1391 0.1307 0.1002
va: 2.1490 2.2734 2.0610 2.0275 3.0432 3.2648 3.0640 3.8894 3.8679 3.8880 4.2572 4.2437 3.9491 3.3630 3.8729 3.9150 3.9155 3.8355 3.9036 4.0005 3.8774 3.8852 4.0224 3.7936 3.9269 0.9925 1.0201 1.0158 1.0148 1.0010 1.0040 1.0006 1.0052 0.9953 1.0080 1.0235 1.0174 1.0156 1.0093 1.0160 0.9746 0.9999 0.9882 0.9881 0.9972 1.0004 1.0047 1.0332
dispcorr: -0.030614820 hartree
energy: -1165.046457220792
dipole: 5.03008 -6.39855 -1.36847 -6.05175 6.29643 0.24468 6.10195 -5.17735 0.92460
magnitude: 1.66957 au
magnitude: 4.24372 debye
