program: Orca
programVersion: 4.2.1
elementType: O O O O N N N C C C C C C C C C C C C C C C C C C H H H H H H H H H H H H H H H H H H H H H H H
charge: 0
multiplicity: 1
keywords: wb97x-d3
keywords: def2-TZVPP
keywords: def2/J RIJCOSX GRIDX6 NOFINALGRIDX
keywords: grid4 nofinalgrid
keywords: scfconv7
keywords: smallprint printgap noloewdin
keywords: NOSOSCF
formula: C18H23N3O4
InChI: InChI=1S/C18H23N3O4/c1-3-5-6-11-25-17(22)16(4-2)21(13-15-8-7-12-24-15)18(23)20-10-9-19-14-20/h3,7-10,12,14,16H,1,4-6,11,13H2,2H3
48 atoms
O  -0.683329 -1.150136 -1.00731
O  -0.513691 0.034446 2.037331
O  -1.05291 -0.86274 -3.190544
O  1.255083 0.83943 -1.736741
N  -0.585606 1.529949 -0.625273
N  1.567349 2.001449 0.190593
N  2.576945 3.517639 1.426477
C  -1.433283 0.977466 -1.677374
C  -1.555432 1.9113 -2.875775
C  -1.242935 1.873419 0.636966
C  -1.011338 -0.434488 -2.062811
C  0.739121 1.411788 -0.797324
C  -2.138304 3.262829 -2.494188
C  -1.552313 0.67842 1.456108
C  -0.202456 -2.484626 -1.219492
C  0.278507 -3.019119 0.1100
C  -2.713222 0.05096 1.757534
C  0.868492 -4.420352 -0.043634
C  2.639174 1.370388 0.777472
C  1.587545 3.296696 0.612845
C  -2.36495 -1.060278 2.584443
C  -1.019773 -1.019512 2.714692
C  3.233939 2.31872 1.545004
C  1.285618 -4.989835 1.274042
C  2.525136 -5.339826 1.596101
H  -2.430745 0.862486 -1.238739
H  -0.583422 2.041067 -3.354794
H  -2.206036 1.43559 -3.610249
H  -2.171392 2.392015 0.403638
H  -0.643769 2.583111 1.201863
H  -2.24868 3.890846 -3.37774
H  -3.126806 3.160221 -2.042464
H  -1.50307 3.805357 -1.79284
H  0.611339 -2.470156 -1.948475
H  -1.006459 -3.105454 -1.621962
H  -0.553388 -3.044577 0.818154
H  1.034167 -2.347138 0.525049
H  -3.698293 0.3444 1.431334
H  1.720607 -4.397107 -0.72784
H  0.116619 -5.075982 -0.495493
H  2.861395 0.329566 0.61391
H  0.882006 4.034313 0.263161
H  -3.030076 -1.787827 3.019872
H  -0.313723 -1.638499 3.243871
H  4.099166 2.204266 2.177451
H  0.496376 -5.105011 2.012606
H  2.765002 -5.737684 2.573897
H  3.348036 -5.239108 0.897455
elementType: O N C H
totalener: -1165.01748998 hartree
nucrepener: 2350.50152133 hartree
electener: -3515.51901131 hartree
oneelecener: -6257.46083545 hartree
twoeener: 2741.94182414 hartree
cpcmener: -0.04808069 hartree
kineticenergy: 1160.05483359 hartree
xcener: -111.464361552166 hartree
chargesum: -0.0000000
charge: -0.247250 -0.278049 -0.467919 -0.472353 -0.112019 -0.019535 -0.389660 0.045755 -0.090856 -0.067957 0.397334 0.379584 -0.305341 0.225866 -0.018369 -0.087857 -0.316738 -0.040510 -0.149392 0.041427 -0.160424 -0.059772 -0.113256 -0.217540 -0.289436 0.119741 0.082266 0.080630 0.141700 0.154177 0.104063 0.091503 0.086819 0.099691 0.110353 0.065536 0.079397 0.172779 0.071731 0.083783 0.182594 0.181865 0.174195 0.178584 0.171636 0.136447 0.131130 0.113650
qa: -0.2472 -0.2780 -0.4679 -0.4724 -0.1120 -0.0195 -0.3897 0.0458 -0.0909 -0.0680 0.3973 0.3796 -0.3053 0.2259 -0.0184 -0.0879 -0.3167 -0.0405 -0.1494 0.0414 -0.1604 -0.0598 -0.1133 -0.2175 -0.2894 0.1197 0.0823 0.0806 0.1417 0.1542 0.1041 0.0915 0.0868 0.0997 0.1104 0.0655 0.0794 0.1728 0.0717 0.0838 0.1826 0.1819 0.1742 0.1786 0.1716 0.1364 0.1311 0.1136
va: 2.1583 2.2611 2.0410 2.0258 3.0975 3.2758 3.1121 3.9164 3.8822 3.8518 4.1822 4.2759 3.9494 3.3824 3.8907 3.8960 3.9903 3.8767 3.9425 4.0259 3.8673 3.8844 4.0269 3.8148 3.9408 1.0024 1.0167 1.0203 0.9959 0.9932 1.0054 0.9982 1.0015 1.0026 0.9989 1.0266 1.0135 0.9992 1.0155 1.0065 0.9945 0.9893 0.9922 0.9902 0.9980 1.0003 1.0026 1.0110
dispcorr: -0.027399089 hartree
energy: -1165.044889067718
dipole: -5.44209 2.92287 -2.51922 -12.05362 11.45748 -0.59614 -0.84650 2.24598 1.39948
magnitude: 2.94286 au
magnitude: 7.48015 debye
