program: Orca
programVersion: 4.2.1
elementType: O O O O N N N C C C C C C C C C C C C C C C C C C H H H H H H H H H H H H H H H H H H H H H H H
charge: 0
multiplicity: 1
keywords: wb97x-d3
keywords: def2-TZVPP
keywords: def2/J RIJCOSX GRIDX6 NOFINALGRIDX
keywords: grid4 nofinalgrid
keywords: scfconv7
keywords: smallprint printgap noloewdin
keywords: NOSOSCF
formula: C18H23N3O4
InChI: InChI=1S/C18H23N3O4/c1-3-5-6-11-25-17(22)16(4-2)21(13-15-8-7-12-24-15)18(23)20-10-9-19-14-20/h3,7-10,12,14,16H,1,4-6,11,13H2,2H3
48 atoms
O  -0.917472 -1.049565 -0.980007
O  -2.116758 -0.267083 1.739283
O  -1.777407 -0.617954 -2.994618
O  0.91282 0.924214 -1.953014
N  -0.636009 1.54988 -0.42799
N  1.654212 1.823436 -0.000702
N  2.958574 3.119398 1.208095
C  -1.699505 1.138999 -1.340613
C  -1.964416 2.162458 -2.440673
C  -0.98506 1.748659 0.983477
C  -1.454661 -0.263253 -1.886825
C  0.619965 1.397944 -0.873683
C  -2.313656 3.532531 -1.882216
C  -0.993835 0.490202 1.771238
C  -0.51276 -2.370895 -1.362401
C  0.30792 -2.933414 -0.224383
C  -0.056028 -0.112192 2.541405
C  0.793461 -4.338765 -0.538562
C  2.729748 1.050383 0.369155
C  1.85152 3.062137 0.528236
C  -0.641983 -1.324923 3.014247
C  -1.888577 -1.365738 2.491764
C  3.509296 1.865734 1.125302
C  1.612927 -4.977394 0.537932
C  1.934476 -4.444415 1.71164
H  -2.610313 1.061175 -0.7382
H  -1.105315 2.23556 -3.108968
H  -2.797995 1.79695 -3.041203
H  -1.962108 2.230512 1.01005
H  -0.303988 2.452386 1.452066
H  -2.558802 4.219287 -2.692009
H  -3.179112 3.487085 -1.218461
H  -1.4870 3.974546 -1.325038
H  0.075352 -2.323865 -2.28198
H  -1.396248 -2.984112 -1.555373
H  -0.291949 -2.939572 0.68816
H  1.162016 -2.276042 -0.038649
H  0.9344 0.259748 2.752506
H  1.381902 -4.336434 -1.462667
H  -0.061242 -4.990777 -0.750507
H  2.826557 0.015797 0.085888
H  1.173748 3.88287 0.351766
H  -0.192539 -2.064727 3.656266
H  -2.697268 -2.074407 2.56983
H  4.437493 1.618514 1.614219
H  1.966793 -5.978506 0.310237
H  2.53431 -4.993225 2.426221
H  1.619886 -3.452551 2.014655
elementType: O N C H
totalener: -1165.01543535 hartree
nucrepener: 2376.23198383 hartree
electener: -3541.24741918 hartree
oneelecener: -6308.69471857 hartree
twoeener: 2767.44729939 hartree
cpcmener: -0.04578487 hartree
kineticenergy: 1160.04663558 hartree
xcener: -111.465423245865 hartree
chargesum: -0.0000000
charge: -0.242215 -0.282156 -0.468765 -0.469017 -0.103372 -0.015579 -0.383436 0.047650 -0.089871 -0.058515 0.389008 0.364983 -0.300637 0.210704 -0.023549 -0.053110 -0.273658 -0.055147 -0.172414 0.038147 -0.198671 -0.031554 -0.106600 -0.194783 -0.300866 0.118461 0.083728 0.080899 0.135424 0.153511 0.103493 0.091264 0.086053 0.102953 0.112485 0.061489 0.057683 0.163179 0.082753 0.080137 0.186340 0.182845 0.174641 0.179215 0.172109 0.134143 0.134464 0.096153
qa: -0.2422 -0.2822 -0.4688 -0.4690 -0.1034 -0.0156 -0.3834 0.0477 -0.0899 -0.0585 0.3890 0.3650 -0.3006 0.2107 -0.0235 -0.0531 -0.2737 -0.0551 -0.1724 0.0381 -0.1987 -0.0316 -0.1066 -0.1948 -0.3009 0.1185 0.0837 0.0809 0.1354 0.1535 0.1035 0.0913 0.0861 0.1030 0.1125 0.0615 0.0577 0.1632 0.0828 0.0801 0.1863 0.1828 0.1746 0.1792 0.1721 0.1341 0.1345 0.0962
va: 2.1515 2.2602 2.0407 2.0278 3.1108 3.2600 3.1111 3.9001 3.8766 3.8609 4.2007 4.2855 3.9497 3.4192 3.8956 3.9055 3.9250 3.9001 3.9373 4.0264 3.8688 3.8738 4.0237 3.8422 3.9192 1.0093 1.0171 1.0207 1.0047 0.9919 1.0044 0.9987 1.0039 1.0043 0.9984 1.0254 1.0061 1.0036 1.0045 1.0051 0.9938 0.9898 0.9912 0.9894 0.9987 0.9999 1.0045 1.0120
dispcorr: -0.029088085 hartree
energy: -1165.044523433557
dipole: -2.47144 0.97777 -1.49367 -10.17085 9.43815 -0.73270 0.68052 1.02301 1.70352
magnitude: 2.38115 au
magnitude: 6.05240 debye
