program: Gaussian 09
title: 000029962
version: EM64L-G09RevD.01
frameworkgroup: C1[X(C11H16N2O)]
method: RPBEPBE
basis: SDD
operation: Freq
keyword: #p
keyword: freq=noraman
keyword: PBEPBE/SDD
title: #p freq=noraman PBEPBE/SDD
converged: YES YES NO NO
title: Mulliken charges:
elementType: O N N C C C C C C C C C C C H H H H H H H H H H H H H H H H
charge: -0.479603 -0.367648 -0.708378 -0.146536 -0.501290 -0.472511 -0.434125 -0.198454 0.502687 -0.603958 -0.477156 0.514311 -0.199453 -0.439947 0.237756 0.240652 0.233136 0.238197 0.242806 0.267134 0.218882 0.249445 0.197413 0.275800 0.225058 0.351602 0.213953 0.213060 0.307059 0.300108
chargesum: 0.00000
title: Mulliken charges with hydrogens summed into heavy atoms:
elementType: O N N C C C C C C C C C C C
charge: -0.128001 -0.100514 -0.101211 0.091220 -0.027503 0.008492 0.034202 -0.001041 0.502687 -0.328158 -0.252097 0.514311 0.014500 -0.226887
polarizability: 1.75313912e+02 7.17975871e+00 1.41298849e+02 -1.49996567e+01 4.20321512e+00 9.11643235e+01
1716.lowfreq: -7.8172 -0.0003 0.0003 0.0007 2.9352 7.9319 24.1645 39.6162 58.6829
frequency: 23.4177 39.5817 58.6809 77.4509 125.3660 162.7865 199.0363 216.2103 251.5347 288.7302 345.3825 355.5069 380.7421 395.4061 403.0788 440.0072 467.7392 523.4864 539.8355 591.0680 618.7097 645.1481 702.3739 735.1266 757.2506 766.2123 786.8913 814.7003 832.9595 859.7722 866.0452 904.8949 920.4087 945.7617 956.0770 970.4301 982.6850 1027.8005 1037.2345 1046.5599 1057.3129 1062.1689 1075.7711 1102.1336 1105.4985 1158.4513 1163.8010 1167.0526 1178.1723 1196.8590 1235.1452 1257.1982 1289.2881 1306.3462 1321.0160 1327.5829 1375.9406 1393.2538 1399.3355 1425.9287 1433.8350 1458.4766 1467.0108 1472.3051 1488.3491 1595.0027 1628.8557 1640.2948 2903.7648 2952.2706 3029.7406 3059.6899 3099.4725 3109.3550 3111.2682 3122.1578 3144.9326 3149.1836 3201.9584 3219.2151 3290.0009 3429.6274 3567.9883 3709.6227
redmass: 4.1914 3.3263 4.8241 2.9344 3.0119 3.4493 3.8683 3.4823 4.0630 3.8149 1.2539 4.0165 1.0704 2.4253 2.9441 2.4028 2.9867 3.9730 4.2059 4.3306 1.6648 2.2698 1.8129 2.0990 1.4586 1.4231 1.7192 1.9327 1.3839 1.4557 2.6873 1.5977 2.7572 2.5483 1.3249 2.5233 4.6942 2.1402 1.2044 2.7089 2.0472 1.3910 2.1963 1.4518 1.2781 1.8439 1.4653 1.6941 1.1578 1.3250 1.5345 1.1789 1.2939 1.4111 1.2657 1.8179 1.6858 2.3044 3.1264 1.1510 1.1741 1.1582 1.2914 3.4932 2.8794 6.1339 3.3340 1.4029 1.0828 1.0667 1.0876 1.0955 1.0509 1.0632 1.0851 1.0913 1.0937 1.0965 1.1174 1.1154 1.0636 1.0741 1.0447 1.1040
irintensity: 1.5128 0.4410 2.7481 0.6723 4.3066 2.4029 3.4544 8.9865 2.0708 8.4421 281.0477 13.0530 12.9255 0.7309 4.0025 2.3225 2.9313 0.7830 1.8329 5.1911 21.1167 20.3272 33.2653 105.8321 55.9658 3.8203 65.5291 4.2205 18.9248 0.3858 11.9744 42.9829 7.5070 9.0877 0.6529 1.9444 10.2071 24.5970 37.5188 38.3926 1.9217 5.9581 21.4003 0.6886 2.4835 38.0067 9.9552 12.0272 5.5110 50.6386 1.5589 13.8250 5.5883 30.0159 11.2693 20.8812 45.2886 37.4382 19.5671 25.2392 5.3784 15.0460 8.7563 70.1114 24.2124 23.9867 56.5719 276.4290 60.2177 51.8180 67.3736 16.3816 19.0487 9.1389 2.4862 34.7176 21.1505 16.8160 0.2273 31.5597 154.5805 0.2781 56.0321 18.4731
temp: 298.150 k
press: 1.00000 atm
elementType: 8 7 7 6 6 6 6 6 6 6 6 6 6 6 1 1 1 1 1 1 1 1 1 1 1 1 1 1 1 1
symmnumber: 1
zpe: 663596.8 jmol-1
zpe.correction: 0.252751 hartree
zpe.thermalcorrener: 0.266777 hartree
zpe.thermalcorrenthalpy: 0.267721 hartree
zpe.thermalcorrgfe: 0.210709 hartree
zpe.sumelectzpe: -612.389257 hartree
zpe.sumelectthermal: -612.375231 hartree
zpe.sumelectthermalent: -612.374287 hartree
zpe.sumelectthermalfe: -612.431299 hartree
dipole: -1.2094 -0.0531 -1.8919
dipole: 2.2460
quadrupole: -67.0673 -73.6058 -90.3451
quadrupole: 10.4987 -2.5680 -1.2508
quadrupole: 9.9388 3.4002 -13.3390 10.4987 -2.5680 -1.2508
hfenergy: -612.6420079 hartree
pointgroup: C01 [X(C11H16N2O1)]
dipole: -0.4761238 0.2902935 -0.6854908 debye
polarizability: 173.9835847|15.6282652|129.3103311|-9.5095232|22.6069483|104.4831686 unknown
InChI: InChI=1S/C11H16N2O/c12-9-3-1-2-8(6-9)11(14)7-13-10-4-5-10/h1-3,6,10-11,13-14H,4-5,7,12H2
charge 0 multiplicity 1
30 atoms
O  -0.817885 -0.30007 1.709403
N  -2.720717 -0.854447 -0.139936
N  3.423787 2.271253 0.916418
C  -3.772115 -0.103394 -0.813034
C  -5.017934 0.265783 -0.000208
C  -3.995373 1.350722 -0.378679
C  -1.338028 -0.65494 -0.647063
C  -0.338562 -0.977962 0.50679
C  1.073797 -0.531975 0.157596
C  1.60207 0.649761 0.712463
C  1.841817 -1.291998 -0.763241
C  2.904275 1.101318 0.354423
C  3.131608 -0.843036 -1.124426
C  3.666986 0.342014 -0.579357
H  -3.932167 -0.315956 -1.882859
H  -5.039259 -0.0561 1.044751
H  -5.986856 0.258839 -0.507171
H  -4.267975 2.083374 -1.143119
H  -3.349347 1.729876 0.418328
H  -2.961523 -1.850452 -0.037557
H  -1.0955 -1.259397 -1.547176
H  -1.234037 0.411656 -0.91474
H  -0.339506 -2.080796 0.673304
H  0.995403 1.197371 1.441648
H  1.444993 -2.225217 -1.180847
H  -1.817799 -0.304665 1.591467
H  3.732225 -1.42487 -1.833598
H  4.672814 0.676015 -0.86373
H  2.889938 2.796265 1.602283
H  4.360168 2.589229 0.686369
