program: Orca
programVersion: 4.2.1
elementType: O O O O N N N C C C C C C C C C C C C C C C C C C H H H H H H H H H H H H H H H H H H H H H H H
charge: 0
multiplicity: 1
keywords: wb97x-d3
keywords: def2-TZVPP
keywords: def2/J RIJCOSX GRIDX6 NOFINALGRIDX
keywords: grid4 nofinalgrid
keywords: scfconv7
keywords: smallprint printgap noloewdin
keywords: NOSOSCF
formula: C18H23N3O4
InChI: InChI=1S/C18H23N3O4/c1-3-5-6-11-25-17(22)16(4-2)21(13-15-8-7-12-24-15)18(23)20-10-9-19-14-20/h3,7-10,12,14,16H,1,4-6,11,13H2,2H3
48 atoms
O  -0.106913 -2.18673 -0.827745
O  -2.23224 2.306363 1.400828
O  -0.93634 -2.054522 -2.896628
O  1.063557 0.344252 -1.837485
N  -0.617421 0.372116 -0.329584
N  1.436469 1.451585 0.102907
N  3.328152 2.189354 0.956791
C  -1.465503 -0.324295 -1.293647
C  -1.966474 0.553701 -2.436675
C  -0.994594 0.234461 1.079224
C  -0.796637 -1.601985 -1.790245
C  0.621543 0.684014 -0.760009
C  -2.716365 1.784847 -1.954243
C  -2.246302 0.955435 1.41381
C  0.653505 -3.360969 -1.141338
C  1.537395 -3.675183 0.044318
C  -3.487452 0.514528 1.731818
C  2.50477 -2.545862 0.403582
C  1.113347 2.540797 0.88593
C  2.792722 1.304078 0.175633
C  -4.291624 1.678529 1.924192
C  -3.474955 2.7334 1.704874
C  2.292992 2.973644 1.397829
C  3.43526 -2.93335 1.506979
C  4.759045 -2.967506 1.414991
H  -2.348812 -0.652422 -0.734632
H  -1.144207 0.846201 -3.090501
H  -2.637557 -0.056997 -3.042564
H  -0.172771 0.55234 1.718891
H  -1.149448 -0.824375 1.29693
H  -3.125783 2.329096 -2.805875
H  -3.553234 1.521009 -1.304193
H  -2.072388 2.475769 -1.410745
H  1.256023 -3.182446 -2.035115
H  -0.024277 -4.191802 -1.350377
H  2.102552 -4.574546 -0.213419
H  0.923146 -3.934652 0.911335
H  -3.794231 -0.516053 1.817612
H  1.93034 -1.672318 0.727149
H  3.073867 -2.246231 -0.481423
H  0.112828 2.923808 0.981168
H  3.314887 0.522379 -0.353502
H  -5.336003 1.719491 2.187587
H  -3.626565 3.800555 1.734106
H  2.4550 3.813906 2.054394
H  2.966515 -3.208656 2.448711
H  5.376378 -3.261816 2.254644
H  5.278034 -2.705262 0.499647
elementType: O N C H
totalener: -1165.02856356 hartree
nucrepener: 2342.95222820 hartree
electener: -3507.98079176 hartree
oneelecener: -6242.00630823 hartree
twoeener: 2734.02551647 hartree
cpcmener: -0.03692363 hartree
kineticenergy: 1160.03851035 hartree
xcener: -111.460710780803 hartree
chargesum: -0.0000000
charge: -0.275893 -0.277223 -0.435242 -0.443174 -0.086479 -0.014100 -0.375321 0.064887 -0.106844 -0.092226 0.373908 0.319217 -0.283881 0.209814 -0.021213 -0.117552 -0.284575 -0.026179 -0.177079 0.057517 -0.167096 -0.047646 -0.107826 -0.206917 -0.282998 0.117534 0.086256 0.081436 0.159917 0.137039 0.107295 0.077238 0.084084 0.104420 0.116229 0.079148 0.080311 0.170561 0.061035 0.081316 0.203389 0.169014 0.172880 0.173302 0.168703 0.135390 0.127911 0.109713
qa: -0.2759 -0.2772 -0.4352 -0.4432 -0.0865 -0.0141 -0.3753 0.0649 -0.1068 -0.0922 0.3739 0.3192 -0.2839 0.2098 -0.0212 -0.1176 -0.2846 -0.0262 -0.1771 0.0575 -0.1671 -0.0476 -0.1078 -0.2069 -0.2830 0.1175 0.0863 0.0814 0.1599 0.1370 0.1073 0.0772 0.0841 0.1044 0.1162 0.0791 0.0803 0.1706 0.0610 0.0813 0.2034 0.1690 0.1729 0.1733 0.1687 0.1354 0.1279 0.1097
va: 2.1403 2.2626 2.0822 2.0532 3.0509 3.2480 3.1304 3.8962 3.8729 3.8185 4.2171 4.2804 3.9446 3.3963 3.8868 3.9301 3.9735 3.8310 3.9048 4.0427 3.8956 3.8972 4.0636 3.8122 3.9499 1.0105 1.0191 1.0189 0.9812 1.0153 1.0052 1.0031 1.0070 1.0020 1.0008 1.0195 1.0140 1.0011 1.0094 1.0144 1.0014 0.9993 0.9926 0.9918 1.0011 1.0000 1.0032 1.0118
dispcorr: -0.028295961 hartree
energy: -1165.056859520555
dipole: -0.30211 -2.30247 -2.60458 -10.04430 9.48040 -0.56390 1.81531 0.12342 1.93873
magnitude: 3.29553 au
magnitude: 8.37657 debye
