program: Orca
programVersion: 4.2.1
elementType: O O O O N N N C C C C C C C C C C C C C C C C C C H H H H H H H H H H H H H H H H H H H H H H H
charge: 0
multiplicity: 1
keywords: wb97x-d3
keywords: def2-TZVPP
keywords: def2/J RIJCOSX GRIDX6 NOFINALGRIDX
keywords: grid4 nofinalgrid
keywords: scfconv7
keywords: smallprint printgap noloewdin
keywords: NOSOSCF
formula: C18H23N3O4
InChI: InChI=1S/C18H23N3O4/c1-3-5-6-11-25-17(22)16(4-2)21(13-15-8-7-12-24-15)18(23)20-10-9-19-14-20/h3,7-10,12,14,16H,1,4-6,11,13H2,2H3
48 atoms
O  1.070676 -2.529859 -0.678275
O  -2.74829 2.344456 -0.195128
O  1.344782 -1.158467 1.071113
O  1.784903 0.584626 -1.385243
N  -0.1561 0.744558 -0.243273
N  1.179508 2.644616 -0.661118
N  0.889659 4.822495 -0.809619
C  -0.393344 -0.671943 -0.505487
C  -0.799892 -0.980054 -1.945899
C  -0.846023 1.312258 0.916949
C  0.789868 -1.467339 0.046191
C  0.967954 1.252703 -0.787625
C  -2.010349 -0.178667 -2.399648
C  -2.308593 1.442809 0.70987
C  2.148538 -3.406307 -0.303714
C  1.611549 -4.759731 0.109924
C  -3.364591 0.797332 1.261484
C  0.760757 -4.775391 1.382968
C  2.427702 3.214353 -0.5393
C  0.293345 3.670933 -0.835718
C  -4.534287 1.341014 0.64838
C  -4.094608 2.271199 -0.228481
C  2.220314 4.552632 -0.613065
C  1.509049 -4.351018 2.607954
C  1.850824 -5.164769 3.600057
H  -1.24411 -0.953173 0.125259
H  0.03183 -0.822068 -2.632416
H  -1.045323 -2.04187 -1.995228
H  -0.396786 2.267754 1.183474
H  -0.683505 0.656176 1.774385
H  -1.798885 0.887437 -2.473384
H  -2.327262 -0.512313 -3.388345
H  -2.859366 -0.309183 -1.725199
H  2.761471 -2.952019 0.474007
H  2.766264 -3.507249 -1.196366
H  2.476649 -5.414375 0.245812
H  1.032703 -5.183395 -0.714907
H  -3.316839 0.025826 2.013716
H  0.377714 -5.788945 1.52252
H  -0.11784 -4.136191 1.246423
H  3.318476 2.62862 -0.390926
H  -0.758914 3.510889 -1.004624
H  -5.560892 1.072548 0.837461
H  -4.598563 2.936258 -0.911299
H  2.954866 5.338421 -0.5351
H  1.789348 -3.303756 2.672476
H  2.402211 -4.806841 4.460593
H  1.594465 -6.218577 3.593271
elementType: O N C H
totalener: -1165.02609576 hartree
nucrepener: 2287.09287281 hartree
electener: -3452.11896857 hartree
oneelecener: -6130.97436024 hartree
twoeener: 2678.85539166 hartree
cpcmener: -0.03358603 hartree
kineticenergy: 1160.03353881 hartree
xcener: -111.460327641845 hartree
chargesum: 0.0000000
charge: -0.266182 -0.277369 -0.452683 -0.456931 -0.128241 -0.043992 -0.376470 0.062876 -0.108833 -0.083000 0.383690 0.399155 -0.285538 0.202461 -0.014806 -0.100231 -0.281533 -0.079954 -0.130317 0.030960 -0.167795 -0.045852 -0.113628 -0.194296 -0.288380 0.116841 0.086952 0.081407 0.156032 0.134560 0.085951 0.106472 0.076161 0.104062 0.114850 0.079863 0.082070 0.170699 0.086765 0.085511 0.181848 0.182206 0.173633 0.173023 0.166499 0.133718 0.129043 0.108725
qa: -0.2662 -0.2774 -0.4527 -0.4569 -0.1282 -0.0440 -0.3765 0.0629 -0.1088 -0.0830 0.3837 0.3992 -0.2855 0.2025 -0.0148 -0.1002 -0.2815 -0.0800 -0.1303 0.0310 -0.1678 -0.0459 -0.1136 -0.1943 -0.2884 0.1168 0.0870 0.0814 0.1560 0.1346 0.0860 0.1065 0.0762 0.1041 0.1148 0.0799 0.0821 0.1707 0.0868 0.0855 0.1818 0.1822 0.1736 0.1730 0.1665 0.1337 0.1290 0.1087
va: 2.1544 2.2621 2.0559 2.0519 3.0853 3.2973 3.1177 3.9090 3.8664 3.8492 4.1728 4.2341 3.9460 3.3752 3.8551 3.8783 3.9683 3.8757 3.9397 4.0119 3.8944 3.8953 4.0286 3.7904 3.9504 1.0053 1.0203 1.0154 0.9862 1.0199 1.0055 1.0059 1.0034 1.0164 1.0013 1.0187 1.0157 1.0004 1.0120 1.0105 0.9983 1.0126 0.9918 0.9920 0.9993 1.0120 1.0028 1.0117
dispcorr: -0.026413651 hartree
energy: -1165.052509414096
dipole: -3.06616 1.36759 -1.69857 -25.27003 23.17511 -2.09492 3.10009 -2.74810 0.35199
magnitude: 2.71988 au
magnitude: 6.91338 debye
