program: Orca
programVersion: 4.2.1
elementType: O O O O N N N C C C C C C C C C C C C C C C C C C H H H H H H H H H H H H H H H H H H H H H H H
charge: 0
multiplicity: 1
keywords: wb97x-d3
keywords: def2-TZVPP
keywords: def2/J RIJCOSX GRIDX6 NOFINALGRIDX
keywords: grid4 nofinalgrid
keywords: scfconv7
keywords: smallprint printgap noloewdin
keywords: NOSOSCF
formula: C18H23N3O4
InChI: InChI=1S/C18H23N3O4/c1-3-5-6-11-25-17(22)16(4-2)21(13-15-8-7-12-24-15)18(23)20-10-9-19-14-20/h3,7-10,12,14,16H,1,4-6,11,13H2,2H3
48 atoms
O  1.402348 -2.305417 -0.121416
O  -2.846033 2.215683 -0.552402
O  1.511456 -0.637842 1.360358
O  1.859915 0.734053 -1.318287
N  -0.127173 0.874304 -0.256267
N  1.046876 2.810808 -0.922055
N  0.573339 4.906212 -1.404907
C  -0.220779 -0.581717 -0.299269
C  -0.540156 -1.147927 -1.682286
C  -0.920955 1.543474 0.775993
C  1.00699 -1.162401 0.399496
C  0.964233 1.401529 -0.845396
C  -1.795314 -0.539994 -2.289037
C  -2.377086 1.506653 0.497829
C  2.53844 -2.971658 0.455765
C  2.183454 -3.790841 1.678299
C  -3.400653 0.859372 1.105395
C  1.141406 -4.877016 1.412448
C  2.232602 3.507193 -0.843702
C  0.08364 3.711703 -1.278413
C  -4.580579 1.194407 0.373504
C  -4.178098 2.015412 -0.621832
C  1.911611 4.794563 -1.124994
C  0.851047 -5.668536 2.646715
C  1.125047 -6.956985 2.809965
H  -1.066041 -0.846262 0.346138
H  0.30182 -1.026702 -2.363455
H  -0.692947 -2.222074 -1.566246
H  -0.568254 2.565151 0.909784
H  -0.746116 1.040403 1.72947
H  -2.654408 -0.633043 -1.62098
H  -1.670657 0.514162 -2.534051
H  -2.048076 -1.057263 -3.215896
H  3.319374 -2.24535 0.686679
H  2.907003 -3.615449 -0.34296
H  1.856221 -3.1385 2.491877
H  3.112886 -4.257209 2.017863
H  -3.32424 0.218663 1.9694
H  1.491583 -5.539406 0.616048
H  0.214511 -4.416326 1.057446
H  3.163218 3.035873 -0.578742
H  -0.940086 3.427504 -1.458005
H  -5.588886 0.865137 0.564323
H  -4.701544 2.519011 -1.418356
H  2.569461 5.648826 -1.141122
H  0.396702 -5.119815 3.467973
H  0.900152 -7.471619 3.735556
H  1.579018 -7.549302 2.023401
elementType: O N C H
totalener: -1165.02801933 hartree
nucrepener: 2263.69048396 hartree
electener: -3428.71850329 hartree
oneelecener: -6084.01047496 hartree
twoeener: 2655.29197167 hartree
cpcmener: -0.03502317 hartree
kineticenergy: 1160.04424440 hartree
xcener: -111.461058878234 hartree
chargesum: -0.0000000
charge: -0.273473 -0.277232 -0.454759 -0.457194 -0.125052 -0.043872 -0.377153 0.067040 -0.107402 -0.085205 0.373546 0.395865 -0.287423 0.203352 0.002209 -0.137774 -0.281703 -0.034405 -0.130770 0.029729 -0.167384 -0.045585 -0.113786 -0.212018 -0.284782 0.120629 0.087224 0.082151 0.156548 0.133307 0.076364 0.086345 0.106801 0.111962 0.113029 0.084701 0.091886 0.171268 0.068164 0.081591 0.182872 0.183292 0.173956 0.172368 0.166566 0.136126 0.128222 0.109858
qa: -0.2735 -0.2772 -0.4548 -0.4572 -0.1251 -0.0439 -0.3772 0.0670 -0.1074 -0.0852 0.3735 0.3959 -0.2874 0.2034 0.0022 -0.1378 -0.2817 -0.0344 -0.1308 0.0297 -0.1674 -0.0456 -0.1138 -0.2120 -0.2848 0.1206 0.0872 0.0822 0.1565 0.1333 0.0764 0.0863 0.1068 0.1120 0.1130 0.0847 0.0919 0.1713 0.0682 0.0816 0.1829 0.1833 0.1740 0.1724 0.1666 0.1361 0.1282 0.1099
va: 2.1489 2.2617 2.0490 2.0504 3.0894 3.2980 3.1184 3.9217 3.8678 3.8524 4.1907 4.2380 3.9452 3.3754 3.8648 3.8412 3.9673 3.8214 3.9397 4.0129 3.8950 3.8950 4.0284 3.8227 3.9431 1.0039 1.0208 1.0140 0.9857 1.0196 1.0036 1.0054 1.0059 1.0147 0.9972 1.0259 1.0181 1.0003 1.0167 1.0158 0.9978 1.0124 0.9918 0.9923 0.9993 0.9998 1.0030 1.0117
dispcorr: -0.025668023 hartree
energy: -1165.053687353127
dipole: -2.13018 0.63974 -1.49044 -27.74998 25.78783 -1.96215 5.19517 -4.38435 0.81082
magnitude: 2.59401 au
magnitude: 6.59344 debye
