program: Orca
programVersion: 4.2.1
elementType: O O O O N N N C C C C C C C C C C C C C C C C C C H H H H H H H H H H H H H H H H H H H H H H H
charge: 0
multiplicity: 1
keywords: wb97x-d3
keywords: def2-TZVPP
keywords: def2/J RIJCOSX GRIDX6 NOFINALGRIDX
keywords: grid4 nofinalgrid
keywords: scfconv7
keywords: smallprint printgap noloewdin
keywords: NOSOSCF
formula: C18H23N3O4
InChI: InChI=1S/C18H23N3O4/c1-3-5-6-11-25-17(22)16(4-2)21(13-15-8-7-12-24-15)18(23)20-10-9-19-14-20/h3,7-10,12,14,16H,1,4-6,11,13H2,2H3
48 atoms
O  1.84717 -2.140233 1.454041
O  -2.560388 1.595976 -0.229419
O  1.573236 -1.608381 -0.698644
O  1.228678 2.560812 0.602983
N  0.208068 0.651749 -0.104023
N  0.31715 2.529135 -1.478536
N  0.262419 2.915044 -3.642505
C  0.72368 -0.12704 1.012035
C  -0.319262 -0.417558 2.097798
C  -0.826135 0.044241 -0.949658
C  1.411404 -1.374641 0.471966
C  0.628116 1.924888 -0.235114
C  -0.850727 0.842973 2.760701
C  -1.977734 0.932548 -1.250386
C  2.524101 -3.367264 1.128783
C  1.550859 -4.492498 0.846654
C  -2.629126 1.199056 -2.406603
C  0.610905 -4.813744 2.011433
C  -0.250971 3.77066 -1.634039
C  0.613522 2.065915 -2.724992
C  -3.691756 2.092156 -2.069956
C  -3.594412 2.302311 -0.738995
C  -0.291741 3.976787 -2.975777
C  1.342872 -5.305751 3.218181
C  1.394885 -4.683728 4.389815
H  1.517921 0.463348 1.477365
H  -1.145968 -1.006213 1.690642
H  0.150445 -1.042304 2.85779
H  -1.182584 -0.840128 -0.418119
H  -0.421276 -0.325242 -1.891292
H  -0.04535 1.424932 3.210968
H  -1.383505 1.488441 2.064799
H  -1.549288 0.578496 3.555325
H  3.130197 -3.584573 2.007851
H  3.198981 -3.213864 0.285616
H  2.150924 -5.374762 0.603799
H  0.965784 -4.270284 -0.048385
H  -2.379071 0.81892 -3.38376
H  -0.087556 -5.586273 1.676177
H  0.004682 -3.940963 2.266357
H  -0.588436 4.360759 -0.799294
H  1.110884 1.121707 -2.88536
H  -4.419731 2.525305 -2.736644
H  -4.158835 2.901207 -0.042636
H  -0.690175 4.832084 -3.497922
H  1.880455 -6.243496 3.097934
H  1.952184 -5.091922 5.22359
H  0.88621 -3.741651 4.561328
elementType: O N C H
totalener: -1165.02359926 hartree
nucrepener: 2304.94830222 hartree
electener: -3469.97190148 hartree
oneelecener: -6166.46705980 hartree
twoeener: 2696.49515832 hartree
cpcmener: -0.03423816 hartree
kineticenergy: 1160.04034808 hartree
xcener: -111.464107660542 hartree
chargesum: 0.0000000
charge: -0.278296 -0.288512 -0.436706 -0.453107 -0.092049 -0.016473 -0.359003 0.076348 -0.097398 -0.109633 0.361312 0.370732 -0.297746 0.274904 -0.015627 -0.133894 -0.316381 -0.057630 -0.124226 0.018186 -0.168683 -0.051139 -0.128810 -0.210067 -0.270907 0.117616 0.080173 0.084485 0.142648 0.141936 0.088708 0.083443 0.103178 0.121749 0.113001 0.092542 0.088679 0.158760 0.092706 0.069932 0.181231 0.168189 0.170232 0.171472 0.160595 0.135167 0.129545 0.108819
qa: -0.2783 -0.2885 -0.4367 -0.4531 -0.0920 -0.0165 -0.3590 0.0763 -0.0974 -0.1096 0.3613 0.3707 -0.2977 0.2749 -0.0156 -0.1339 -0.3164 -0.0576 -0.1242 0.0182 -0.1687 -0.0511 -0.1288 -0.2101 -0.2709 0.1176 0.0802 0.0845 0.1426 0.1419 0.0887 0.0834 0.1032 0.1217 0.1130 0.0925 0.0887 0.1588 0.0927 0.0699 0.1812 0.1682 0.1702 0.1715 0.1606 0.1352 0.1295 0.1088
va: 2.1374 2.2765 2.0560 2.0556 3.0560 3.2434 3.0978 3.8166 3.8667 3.8060 4.2465 4.2636 3.9422 3.3939 3.8421 3.8508 3.9445 3.8659 3.8970 4.0608 3.9141 3.8850 4.0282 3.8153 3.9241 1.0378 1.0094 1.0232 0.9902 0.9994 1.0058 1.0169 1.0024 0.9995 1.0166 1.0128 1.0234 1.0107 1.0096 1.0162 0.9966 1.0016 0.9937 0.9923 1.0021 1.0007 1.0026 1.0101
dispcorr: -0.027903177 hartree
energy: -1165.051502437669
dipole: -0.98209 -0.11571 -1.09780 -22.41128 20.20730 -2.20398 17.73741 -16.36623 1.37118
magnitude: 2.81830 au
magnitude: 7.16356 debye
