program: Orca
programVersion: 4.2.1
elementType: O O O O N N N C C C C C C C C C C C C C C C C C C H H H H H H H H H H H H H H H H H H H H H H H
charge: 0
multiplicity: 1
keywords: wb97x-d3
keywords: def2-TZVPP
keywords: def2/J RIJCOSX GRIDX6 NOFINALGRIDX
keywords: grid4 nofinalgrid
keywords: scfconv7
keywords: smallprint printgap noloewdin
keywords: NOSOSCF
formula: C18H23N3O4
InChI: InChI=1S/C18H23N3O4/c1-3-5-6-11-25-17(22)16(4-2)21(13-15-8-7-12-24-15)18(23)20-10-9-19-14-20/h3,7-10,12,14,16H,1,4-6,11,13H2,2H3
48 atoms
O  -0.213122 -1.174631 -0.622258
O  -0.363996 0.141635 2.010084
O  -0.5455 -1.362681 -2.825732
O  1.546474 0.901125 -1.613266
N  -0.433583 1.490898 -0.699328
N  1.589873 2.378333 0.109944
N  2.299846 4.203733 1.114344
C  -1.128023 0.694163 -1.707103
C  -1.214352 1.394622 -3.059887
C  -1.19335 1.842271 0.503424
C  -0.57224 -0.723164 -1.804806
C  0.907535 1.529575 -0.796656
C  -1.911633 2.742567 -2.968689
C  -1.433231 0.667201 1.375752
C  0.299792 -2.503707 -0.487768
C  -0.810945 -3.521169 -0.321766
C  -2.540978 -0.061031 1.653047
C  -0.259869 -4.88598 0.098274
C  2.762459 2.041473 0.744855
C  1.370601 3.702073 0.359438
C  -2.117333 -1.119299 2.513045
C  -0.786933 -0.94612 2.68514
C  3.169016 3.175341 1.371437
C  0.336963 -4.863735 1.469971
C  1.59352 -5.172201 1.766837
H  -2.152858 0.566276 -1.339918
H  -0.220913 1.510878 -3.495091
H  -1.77475 0.747097 -3.735611
H  -2.151078 2.25994 0.193648
H  -0.687117 2.630055 1.056006
H  -1.99252 3.195168 -3.957422
H  -2.92448 2.646483 -2.572042
H  -1.36981 3.448028 -2.337539
H  0.926015 -2.463655 0.403307
H  0.943368 -2.753669 -1.334456
H  -1.366824 -3.626927 -1.255653
H  -1.51614 -3.165703 0.434855
H  -3.537214 0.126293 1.284485
H  0.476211 -5.24022 -0.629114
H  -1.085327 -5.603616 0.079413
H  3.174414 1.047483 0.709249
H  0.538035 4.241567 -0.065409
H  -2.723358 -1.901791 2.94024
H  -0.042726 -1.486722 3.247845
H  4.039262 3.307289 1.994553
H  -0.332111 -4.556337 2.270912
H  1.95961 -5.137201 2.785279
H  2.302863 -5.480032 1.006566
elementType: O N C H
totalener: -1165.02503868 hartree
nucrepener: 2361.22246951 hartree
electener: -3526.24750819 hartree
oneelecener: -6278.97480076 hartree
twoeener: 2752.72729257 hartree
cpcmener: -0.03853649 hartree
kineticenergy: 1160.05947679 hartree
xcener: -111.465218442277 hartree
chargesum: -0.0000000
charge: -0.248815 -0.275050 -0.445306 -0.449206 -0.124205 -0.025345 -0.380107 0.033530 -0.092789 -0.070510 0.383913 0.377148 -0.298552 0.237799 -0.023905 -0.137865 -0.309053 -0.055105 -0.140666 0.037809 -0.172849 -0.046011 -0.112172 -0.202218 -0.275201 0.114748 0.084755 0.080615 0.134356 0.149231 0.102737 0.087987 0.086305 0.112635 0.116923 0.093404 0.083752 0.167127 0.076622 0.091156 0.181273 0.177296 0.170896 0.168816 0.167735 0.126504 0.128656 0.111200
qa: -0.2488 -0.2751 -0.4453 -0.4492 -0.1242 -0.0253 -0.3801 0.0335 -0.0928 -0.0705 0.3839 0.3771 -0.2986 0.2378 -0.0239 -0.1379 -0.3091 -0.0551 -0.1407 0.0378 -0.1728 -0.0460 -0.1122 -0.2022 -0.2752 0.1147 0.0848 0.0806 0.1344 0.1492 0.1027 0.0880 0.0863 0.1126 0.1169 0.0934 0.0838 0.1671 0.0766 0.0912 0.1813 0.1773 0.1709 0.1688 0.1677 0.1265 0.1287 0.1112
va: 2.1457 2.2692 2.0688 2.0564 3.0887 3.2865 3.1156 3.9248 3.8740 3.8604 4.2101 4.2749 3.9453 3.3932 3.7978 3.8763 3.9942 3.8742 3.9437 4.0301 3.8425 3.8708 4.0244 3.8075 3.9313 1.0013 1.0183 1.0207 0.9989 0.9959 1.0054 0.9993 1.0024 1.0075 1.0149 1.0251 1.0132 1.0011 1.0118 1.0061 0.9965 0.9898 0.9938 0.9945 0.9989 1.0049 1.0030 1.0100
dispcorr: -0.028216945 hartree
energy: -1165.053255624333
dipole: -9.10504 6.71879 -2.38625 -14.77225 13.92029 -0.85196 -2.02530 3.26112 1.23582
magnitude: 2.81909 au
magnitude: 7.16557 debye
