program: Orca
programVersion: 4.2.1
elementType: O O O O N N N C C C C C C C C C C C C C C C C C C H H H H H H H H H H H H H H H H H H H H H H H
charge: 0
multiplicity: 1
keywords: wb97x-d3
keywords: def2-TZVPP
keywords: def2/J RIJCOSX GRIDX6 NOFINALGRIDX
keywords: grid4 nofinalgrid
keywords: scfconv7
keywords: smallprint printgap noloewdin
keywords: NOSOSCF
formula: C18H23N3O4
InChI: InChI=1S/C18H23N3O4/c1-3-5-6-11-25-17(22)16(4-2)21(13-15-8-7-12-24-15)18(23)20-10-9-19-14-20/h3,7-10,12,14,16H,1,4-6,11,13H2,2H3
48 atoms
O  0.464238 -1.721707 0.493899
O  -2.500039 0.177007 -1.560042
O  0.313431 -0.782688 -1.525535
O  -0.445973 3.832792 -0.7938
N  -0.206166 1.659467 -0.177705
N  1.535477 2.841429 -1.241318
N  3.46648 3.743588 -1.79412
C  0.675261 0.639048 0.380241
C  0.62509 0.593859 1.909481
C  -1.618192 1.582339 0.207023
C  0.439035 -0.695814 -0.329627
C  0.218647 2.821809 -0.721396
C  0.907651 1.951225 2.53387
C  -2.257099 0.32252 -0.239581
C  0.251055 -3.040602 -0.035878
C  -0.285574 -3.92141 1.068709
C  -2.6643 -0.785393 0.427191
C  0.65046 -4.087111 2.255732
C  2.173694 1.927741 -2.054652
C  2.361571 3.923224 -1.138953
C  -3.182121 -1.678728 -0.557594
C  -3.047059 -1.039193 -1.742536
C  3.356803 2.508008 -2.379364
C  0.13921 -4.978225 3.344497
C  -1.030584 -5.607104 3.37506
H  1.703893 0.902156 0.121496
H  -0.325868 0.198402 2.271749
H  1.389319 -0.11068 2.239389
H  -2.136492 2.4396 -0.217767
H  -1.724272 1.663943 1.29035
H  0.129487 2.686289 2.322831
H  0.972761 1.860398 3.618178
H  1.857109 2.363752 2.186318
H  1.200576 -3.41734 -0.425384
H  -0.461392 -3.00114 -0.860512
H  -0.485898 -4.89662 0.616139
H  -1.25307 -3.532113 1.398245
H  -2.598469 -0.94977 1.491046
H  0.880743 -3.112814 2.699054
H  1.615886 -4.478072 1.914385
H  1.725466 0.994349 -2.348402
H  2.099263 4.79196 -0.555698
H  -3.596334 -2.661538 -0.40118
H  -3.299084 -1.311191 -2.755238
H  4.134298 2.10701 -3.010411
H  0.813849 -5.102135 4.187066
H  -1.306733 -6.228433 4.21785
H  -1.759959 -5.536606 2.577143
elementType: O N C H
totalener: -1165.02537988 hartree
nucrepener: 2327.20828584 hartree
electener: -3492.23366572 hartree
oneelecener: -6210.42131523 hartree
twoeener: 2718.18764951 hartree
cpcmener: -0.03658044 hartree
kineticenergy: 1160.02779320 hartree
xcener: -111.465076908680 hartree
chargesum: -0.0000000
charge: -0.253069 -0.274966 -0.443533 -0.455985 -0.091646 -0.031349 -0.378978 0.005325 -0.085140 -0.105908 0.363199 0.373582 -0.292987 0.209583 -0.044308 -0.100683 -0.245649 -0.022170 -0.185781 0.066012 -0.214908 -0.010126 -0.110935 -0.200031 -0.296685 0.136773 0.081039 0.082903 0.132480 0.138874 0.081407 0.108705 0.091502 0.129679 0.118343 0.084478 0.063698 0.162233 0.077382 0.075781 0.211421 0.169474 0.172593 0.176533 0.168188 0.130656 0.130810 0.102185
qa: -0.2531 -0.2750 -0.4435 -0.4560 -0.0916 -0.0313 -0.3790 0.0053 -0.0851 -0.1059 0.3632 0.3736 -0.2930 0.2096 -0.0443 -0.1007 -0.2456 -0.0222 -0.1858 0.0660 -0.2149 -0.0101 -0.1109 -0.2000 -0.2967 0.1368 0.0810 0.0829 0.1325 0.1389 0.0814 0.1087 0.0915 0.1297 0.1183 0.0845 0.0637 0.1622 0.0774 0.0758 0.2114 0.1695 0.1726 0.1765 0.1682 0.1307 0.1308 0.1022
va: 2.1616 2.2834 2.0401 2.0539 3.0690 3.2592 3.1198 3.9408 3.8845 3.9121 4.1680 4.2606 3.9544 3.4734 3.8634 3.9294 3.8939 3.8388 3.9065 4.0236 3.8839 3.8781 4.0568 3.8512 3.9153 0.9856 1.0081 1.0165 1.0325 0.9942 1.0069 1.0040 1.0016 0.9995 1.0088 1.0104 1.0078 1.0012 1.0112 1.0074 1.0001 1.0013 0.9923 0.9885 1.0014 1.0006 1.0046 1.0146
dispcorr: -0.028052822 hartree
energy: -1165.053432703301
dipole: -0.69222 -0.06764 -0.75986 -22.76934 19.65428 -3.11507 21.15809 -18.95359 2.20450
magnitude: 3.89112 au
magnitude: 9.89045 debye
