program: Orca
programVersion: 4.2.1
elementType: O O O O N N N C C C C C C C C C C C C C C C C C C H H H H H H H H H H H H H H H H H H H H H H H
charge: 0
multiplicity: 1
keywords: wb97x-d3
keywords: def2-TZVPP
keywords: def2/J RIJCOSX GRIDX6 NOFINALGRIDX
keywords: grid4 nofinalgrid
keywords: scfconv7
keywords: smallprint printgap noloewdin
keywords: NOSOSCF
formula: C18H23N3O4
InChI: InChI=1S/C18H23N3O4/c1-3-5-6-11-25-17(22)16(4-2)21(13-15-8-7-12-24-15)18(23)20-10-9-19-14-20/h3,7-10,12,14,16H,1,4-6,11,13H2,2H3
48 atoms
O  -0.167719 -2.322324 -0.722329
O  -2.276784 2.282168 1.278168
O  -0.843469 -2.173413 -2.854227
O  1.136385 0.182145 -1.75179
N  -0.605202 0.282212 -0.318319
N  1.436411 1.370206 0.152602
N  2.112097 3.057831 1.395925
C  -1.424327 -0.421415 -1.301969
C  -1.853306 0.438222 -2.488172
C  -1.04549 0.191056 1.076006
C  -0.761637 -1.723684 -1.74144
C  0.653816 0.567954 -0.707988
C  -2.575535 1.709702 -2.073878
C  -2.303073 0.932617 1.335139
C  0.617221 -3.506538 -0.933926
C  2.063929 -3.231854 -0.585305
C  -3.559381 0.51147 1.618306
C  2.293067 -2.890176 0.886519
C  2.806147 1.256264 0.256647
C  1.080766 2.490578 0.852421
C  -4.360641 1.687133 1.739228
C  -3.526972 2.728076 1.517761
C  3.193986 2.291381 1.0422
C  3.744043 -2.72544 1.208434
C  4.276549 -1.6806 1.830994
H  -2.339364 -0.715957 -0.77602
H  -0.999133 0.681383 -3.120812
H  -2.523885 -0.168344 -3.09871
H  -0.248187 0.519168 1.741286
H  -1.221975 -0.858872 1.318711
H  -2.952979 2.226251 -2.957006
H  -3.431838 1.499752 -1.429652
H  -1.922207 2.40688 -1.550439
H  0.526281 -3.848855 -1.964167
H  0.196764 -4.27775 -0.285518
H  2.451567 -2.437698 -1.229041
H  2.626338 -4.135452 -0.838233
H  -3.877362 -0.513512 1.726674
H  1.882926 -3.70213 1.498205
H  1.748941 -1.984583 1.167269
H  3.359517 0.459467 -0.209986
H  0.066393 2.851078 0.900465
H  -5.414085 1.744712 1.959744
H  -3.670586 3.79659 1.504492
H  4.192494 2.528946 1.373383
H  4.395203 -3.541281 0.903179
H  5.337968 -1.626097 2.038536
H  3.674916 -0.841924 2.163109
elementType: O N C H
totalener: -1165.02651350 hartree
nucrepener: 2358.06537861 hartree
electener: -3523.09189211 hartree
oneelecener: -6272.41350241 hartree
twoeener: 2749.32161031 hartree
cpcmener: -0.03493919 hartree
kineticenergy: 1160.03799504 hartree
xcener: -111.461798719330 hartree
chargesum: -0.0000000
charge: -0.279884 -0.277449 -0.434398 -0.443069 -0.089409 -0.013948 -0.373155 0.046929 -0.106387 -0.102457 0.382727 0.337183 -0.284050 0.214150 -0.020646 -0.103818 -0.284130 -0.045206 -0.157961 0.032582 -0.164280 -0.049322 -0.100776 -0.197694 -0.295111 0.115781 0.085477 0.082280 0.157394 0.137625 0.107577 0.076120 0.085055 0.110616 0.106732 0.079407 0.091546 0.170472 0.094570 0.056777 0.181253 0.182861 0.172523 0.172561 0.167623 0.130722 0.129925 0.114684
qa: -0.2799 -0.2774 -0.4344 -0.4431 -0.0894 -0.0139 -0.3732 0.0469 -0.1064 -0.1025 0.3827 0.3372 -0.2840 0.2142 -0.0206 -0.1038 -0.2841 -0.0452 -0.1580 0.0326 -0.1643 -0.0493 -0.1008 -0.1977 -0.2951 0.1158 0.0855 0.0823 0.1574 0.1376 0.1076 0.0761 0.0851 0.1106 0.1067 0.0794 0.0915 0.1705 0.0946 0.0568 0.1813 0.1829 0.1725 0.1726 0.1676 0.1307 0.1299 0.1147
va: 2.1348 2.2629 2.0869 2.0563 3.0598 3.2500 3.1257 3.8674 3.8735 3.8256 4.2456 4.2652 3.9478 3.3886 3.8621 3.8479 3.9726 3.8542 3.9415 4.0076 3.8920 3.8998 4.0357 3.8079 3.9501 1.0108 1.0198 1.0176 0.9847 1.0136 1.0053 1.0032 1.0054 1.0261 0.9968 1.0242 1.0185 1.0012 1.0071 1.0168 0.9983 1.0139 0.9926 0.9923 0.9996 1.0037 1.0044 1.0048
dispcorr: -0.029153377 hartree
energy: -1165.055666879425
dipole: 1.69598 -3.37192 -1.67594 -9.76298 8.41470 -1.34828 1.00118 0.52515 1.52633
magnitude: 2.63748 au
magnitude: 6.70395 debye
