program: Orca
programVersion: 4.2.1
elementType: O O O O N N N C C C C C C C C C C C C C C C C C C H H H H H H H H H H H H H H H H H H H H H H H
charge: 0
multiplicity: 1
keywords: wb97x-d3
keywords: def2-TZVPP
keywords: def2/J RIJCOSX GRIDX6 NOFINALGRIDX
keywords: grid4 nofinalgrid
keywords: scfconv7
keywords: smallprint printgap noloewdin
keywords: NOSOSCF
formula: C18H23N3O4
InChI: InChI=1S/C18H23N3O4/c1-3-5-6-11-25-17(22)16(4-2)21(13-15-8-7-12-24-15)18(23)20-10-9-19-14-20/h3,7-10,12,14,16H,1,4-6,11,13H2,2H3
48 atoms
O  0.107653 -0.935229 1.047301
O  -1.574384 -0.41816 -1.79713
O  -1.220715 -0.406627 2.76219
O  -0.090838 2.720779 -1.849632
N  -0.525418 1.615049 0.085619
N  1.672165 2.195274 -0.526289
N  3.724209 1.458918 -0.222909
C  -0.17933 1.358361 1.480294
C  -0.816419 2.360057 2.439886
C  -1.930915 1.441219 -0.280119
C  -0.511373 -0.086835 1.844067
C  0.283584 2.201397 -0.822378
C  -0.43793 3.794749 2.109097
C  -2.236056 0.056326 -0.720433
C  -0.126083 -2.339219 1.234434
C  0.633311 -3.080716 0.157486
C  -3.095013 -0.882129 -0.255234
C  0.304209 -4.564983 0.195808
C  2.505985 3.270299 -0.732606
C  2.470123 1.125078 -0.236806
C  -2.94789 -2.017428 -1.109935
C  -2.00776 -1.677107 -2.020151
C  3.76032 2.79694 -0.5187
C  0.973682 -5.395958 -0.852715
C  1.797902 -4.96637 -1.80117
H  0.900984 1.454789 1.596594
H  -1.902789 2.254472 2.466403
H  -0.466119 2.11516 3.444011
H  -2.190889 2.16333 -1.053302
H  -2.561764 1.675896 0.576547
H  0.64526 3.927233 2.065451
H  -0.856522 4.127743 1.158176
H  -0.81584 4.470988 2.87582
H  -1.197865 -2.538533 1.163536
H  0.210569 -2.636405 2.230834
H  1.707983 -2.930575 0.292171
H  0.367667 -2.669261 -0.819602
H  -3.749127 -0.781904 0.596181
H  -0.778861 -4.704674 0.099983
H  0.555522 -4.981118 1.177843
H  2.136053 4.249886 -0.983575
H  2.073311 0.135803 -0.072665
H  -3.467366 -2.959742 -1.045741
H  -1.56889 -2.200707 -2.854451
H  4.687745 3.345992 -0.559364
H  0.738917 -6.455802 -0.81153
H  2.226925 -5.655186 -2.517987
H  2.081132 -3.926443 -1.910842
elementType: O N C H
totalener: -1165.02547208 hartree
nucrepener: 2355.64165266 hartree
electener: -3520.66712475 hartree
oneelecener: -6267.29776867 hartree
twoeener: 2746.63064393 hartree
cpcmener: -0.03581317 hartree
kineticenergy: 1160.03716843 hartree
xcener: -111.463381167322 hartree
chargesum: -0.0000000
charge: -0.253108 -0.277686 -0.416411 -0.445790 -0.103582 -0.028019 -0.375254 -0.027613 -0.106739 -0.058700 0.377145 0.356697 -0.288416 0.238329 -0.047723 -0.116958 -0.311115 -0.042061 -0.141112 0.031308 -0.169555 -0.049534 -0.107655 -0.197148 -0.296302 0.139850 0.076219 0.087415 0.135257 0.149199 0.089377 0.086294 0.107530 0.112203 0.134428 0.098386 0.077633 0.161148 0.078449 0.084594 0.184858 0.181662 0.166877 0.176417 0.165712 0.130020 0.130979 0.102493
qa: -0.2531 -0.2777 -0.4164 -0.4458 -0.1036 -0.0280 -0.3753 -0.0276 -0.1067 -0.0587 0.3771 0.3567 -0.2884 0.2383 -0.0477 -0.1170 -0.3111 -0.0421 -0.1411 0.0313 -0.1696 -0.0495 -0.1077 -0.1971 -0.2963 0.1399 0.0762 0.0874 0.1353 0.1492 0.0894 0.0863 0.1075 0.1122 0.1344 0.0984 0.0776 0.1611 0.0784 0.0846 0.1849 0.1817 0.1669 0.1764 0.1657 0.1300 0.1310 0.1025
va: 2.1374 2.2642 2.0833 2.0617 3.0685 3.2583 3.1140 3.9644 3.8919 3.8405 4.2191 4.2751 3.9558 3.4017 3.8486 3.8899 3.9271 3.8665 3.9244 4.0149 3.8459 3.8586 4.0186 3.8464 3.9213 0.9884 1.0121 1.0169 1.0223 0.9941 1.0008 1.0035 1.0062 0.9952 1.0044 1.0084 1.0036 1.0076 1.0058 1.0056 0.9955 1.0090 0.9963 0.9918 0.9991 1.0009 1.0044 1.0142
dispcorr: -0.028748021 hartree
energy: -1165.054220105884
dipole: -1.40148 0.02248 -1.37900 -11.52694 10.86985 -0.65709 6.55985 -5.44061 1.11924
magnitude: 1.89370 au
magnitude: 4.81341 debye
