program: Orca
programVersion: 4.2.1
elementType: O O O O N N N C C C C C C C C C C C C C C C C C C H H H H H H H H H H H H H H H H H H H H H H H
charge: 0
multiplicity: 1
keywords: wb97x-d3
keywords: def2-TZVPP
keywords: def2/J RIJCOSX GRIDX6 NOFINALGRIDX
keywords: grid4 nofinalgrid
keywords: scfconv7
keywords: smallprint printgap noloewdin
keywords: NOSOSCF
formula: C18H23N3O4
InChI: InChI=1S/C18H23N3O4/c1-3-5-6-11-25-17(22)16(4-2)21(13-15-8-7-12-24-15)18(23)20-10-9-19-14-20/h3,7-10,12,14,16H,1,4-6,11,13H2,2H3
48 atoms
O  0.629347 -1.756368 0.30067
O  -3.306691 0.951625 0.699625
O  -0.028898 -2.817086 -1.559348
O  1.433863 0.257412 -1.728904
N  -0.440996 0.562417 -0.484364
N  1.179771 2.246114 -0.65956
N  1.144946 4.434563 -0.386234
C  -0.993281 -0.671514 -1.032473
C  -1.44046 -0.541559 -2.488374
C  -0.88099 0.959225 0.855262
C  -0.063919 -1.868145 -0.829624
C  0.759881 0.942151 -1.001965
C  -2.447478 0.577772 -2.702434
C  -2.184368 1.67231 0.913615
C  1.574117 -2.784106 0.609651
C  0.928559 -3.975939 1.292596
C  -2.515199 2.957552 1.19033
C  1.967007 -5.043688 1.647021
C  2.48984 2.642316 -0.51681
C  0.418723 3.38229 -0.588369
C  -3.938379 3.030439 1.128978
C  -4.358593 1.783137 0.824221
C  2.438106 3.985957 -0.327067
C  2.971854 -4.575835 2.652087
C  4.280424 -4.501017 2.448735
H  -1.889911 -0.888855 -0.442569
H  -0.575385 -0.405839 -3.136934
H  -1.885002 -1.493851 -2.778826
H  -0.127179 1.595577 1.313855
H  -0.923003 0.058061 1.473939
H  -2.76023 0.608434 -3.745714
H  -3.34295 0.438684 -2.095897
H  -2.034759 1.557143 -2.460046
H  2.302287 -2.309944 1.267181
H  2.096316 -3.097214 -0.297058
H  0.176955 -4.416542 0.63569
H  0.411375 -3.646536 2.198764
H  -1.829972 3.75906 1.415605
H  2.475126 -5.381348 0.739355
H  1.439959 -5.915194 2.045913
H  3.306084 1.94301 -0.557443
H  -0.650359 3.365164 -0.732373
H  -4.557601 3.896223 1.291629
H  -5.334652 1.352595 0.674971
H  3.261029 4.660836 -0.156127
H  2.572151 -4.273224 3.616977
H  4.956931 -4.157234 3.219239
H  4.727669 -4.791455 1.505604
totalener: -1164.99904638 hartree
nucrepener: 2275.57746579 hartree
electener: -3440.57651217 hartree
oneelecener: -6107.47748560 hartree
twoeener: 2666.90097343 hartree
kineticenergy: 1160.07719725 hartree
xcener: -111.460614592926 hartree
chargesum: -0.0000000
charge: -0.286540 -0.269165 -0.352852 -0.361501 -0.108752 -0.049331 -0.304815 0.004084 -0.095077 -0.097827 0.355004 0.326897 -0.269672 0.212765 0.005035 -0.126488 -0.279638 -0.092198 -0.115849 0.009322 -0.132935 -0.030066 -0.078528 -0.176896 -0.207329 0.089559 0.095893 0.086612 0.138839 0.127643 0.099897 0.072669 0.080619 0.102279 0.097314 0.097629 0.066615 0.164122 0.077410 0.085634 0.158668 0.159418 0.144434 0.145077 0.132155 0.109161 0.104661 0.086043
qa: -0.2865 -0.2692 -0.3529 -0.3615 -0.1088 -0.0493 -0.3048 0.0041 -0.0951 -0.0978 0.3550 0.3269 -0.2697 0.2128 0.0050 -0.1265 -0.2796 -0.0922 -0.1158 0.0093 -0.1329 -0.0301 -0.0785 -0.1769 -0.2073 0.0896 0.0959 0.0866 0.1388 0.1276 0.0999 0.0727 0.0806 0.1023 0.0973 0.0976 0.0666 0.1641 0.0774 0.0856 0.1587 0.1594 0.1444 0.1451 0.1322 0.1092 0.1047 0.0860
va: 2.1360 2.2814 2.1568 2.1375 2.9982 3.2845 3.1305 4.0243 3.8403 3.8815 4.2084 4.2821 3.9433 3.4068 3.8598 3.8505 4.0201 3.9091 3.9314 4.0354 3.9565 3.9301 4.0374 3.8382 3.9569 1.0178 1.0214 1.0226 0.9931 1.0193 1.0087 1.0059 1.0025 1.0115 1.0152 1.0260 1.0131 1.0052 1.0118 1.0076 1.0083 1.0004 1.0026 1.0011 1.0076 1.0077 1.0087 1.0150
dispcorr: -0.025758396 hartree
energy: -1165.024804775611
dipole: 1.95020 -2.78565 -0.83545 -16.81747 16.39895 -0.41851 4.89870 -3.57536 1.32334
magnitude: 1.61999 au
magnitude: 4.11768 debye
