program: Orca
programVersion: 4.2.1
elementType: O O O O N N N C C C C C C C C C C C C C C C C C C H H H H H H H H H H H H H H H H H H H H H H H
charge: 0
multiplicity: 1
keywords: wb97x-d3
keywords: def2-TZVPP
keywords: def2/J RIJCOSX GRIDX6 NOFINALGRIDX
keywords: grid4 nofinalgrid
keywords: scfconv7
keywords: smallprint printgap noloewdin
keywords: NOSOSCF
formula: C18H23N3O4
InChI: InChI=1S/C18H23N3O4/c1-3-5-6-11-25-17(22)16(4-2)21(13-15-8-7-12-24-15)18(23)20-10-9-19-14-20/h3,7-10,12,14,16H,1,4-6,11,13H2,2H3
48 atoms
O  -0.053552 -0.964735 -0.052237
O  -3.616564 0.261655 0.111092
O  -1.2915 -1.166968 1.805661
O  0.072649 1.52537 -2.277311
N  -0.591177 1.701164 -0.101181
N  1.681476 1.586905 -0.682552
N  3.822265 1.060979 -0.715626
C  -0.414147 1.002463 1.172805
C  -1.21649 1.616928 2.312857
C  -1.966749 1.915616 -0.550048
C  -0.672223 -0.50014 1.026477
C  0.33274 1.582724 -1.103213
C  -0.877122 3.0816 2.544509
C  -2.741116 0.674975 -0.833826
C  -0.182845 -2.353606 -0.37239
C  0.80894 -3.216081 0.383681
C  -2.746534 -0.195595 -1.873035
C  2.271452 -2.837816 0.144919
C  2.285972 2.344159 0.298517
C  2.669226 0.846411 -1.265328
C  -3.684803 -1.21411 -1.536698
C  -4.175831 -0.879964 -0.320343
C  3.600136 2.001742 0.253175
C  3.200378 -3.72373 0.911083
C  4.107235 -4.527785 0.37362
H  0.639467 1.081487 1.453628
H  -2.287903 1.484364 2.157462
H  -0.987511 1.045096 3.21253
H  -1.928584 2.532991 -1.444627
H  -2.48507 2.502203 0.208942
H  0.178804 3.210688 2.789058
H  -1.089483 3.703071 1.673676
H  -1.451899 3.481082 3.379025
H  0.000652 -2.404246 -1.446164
H  -1.207528 -2.681005 -0.189147
H  0.649074 -4.249089 0.061837
H  0.577878 -3.194597 1.451436
H  -2.143362 -0.117065 -2.761783
H  2.441583 -1.798571 0.442044
H  2.502487 -2.894438 -0.922826
H  1.747615 3.069608 0.883736
H  2.463669 0.162665 -2.073313
H  -3.960695 -2.072932 -2.125448
H  -4.900594 -1.339519 0.330508
H  4.403729 2.388492 0.859316
H  3.097094 -3.697125 1.992675
H  4.748313 -5.149331 0.983601
H  4.251118 -4.588169 -0.698389
totalener: -1164.99694419 hartree
nucrepener: 2385.86654651 hartree
electener: -3550.86349070 hartree
oneelecener: -6328.05687237 hartree
twoeener: 2777.19338167 hartree
kineticenergy: 1160.08604512 hartree
xcener: -111.463746990309 hartree
chargesum: 0.0000000
charge: -0.257037 -0.250299 -0.330678 -0.364044 -0.133881 0.003031 -0.295715 0.030583 -0.073174 -0.110992 0.246027 0.331299 -0.272100 0.186839 -0.029974 -0.134742 -0.240158 -0.038532 -0.180374 0.044897 -0.159017 -0.002840 -0.078209 -0.170383 -0.211337 0.115626 0.077911 0.087277 0.129329 0.126096 0.071443 0.083474 0.104205 0.102448 0.115302 0.084987 0.089488 0.152306 0.082962 0.056844 0.178015 0.138567 0.140341 0.139602 0.132118 0.103997 0.099909 0.078565
qa: -0.2570 -0.2503 -0.3307 -0.3640 -0.1339 0.0030 -0.2957 0.0306 -0.0732 -0.1110 0.2460 0.3313 -0.2721 0.1868 -0.0300 -0.1347 -0.2402 -0.0385 -0.1804 0.0449 -0.1590 -0.0028 -0.0782 -0.1704 -0.2113 0.1156 0.0779 0.0873 0.1293 0.1261 0.0714 0.0835 0.1042 0.1024 0.1153 0.0850 0.0895 0.1523 0.0830 0.0568 0.1780 0.1386 0.1403 0.1396 0.1321 0.1040 0.0999 0.0786
va: 2.1072 2.3053 2.1675 2.1339 2.9911 3.2509 3.1037 3.9309 3.8700 3.9434 4.3101 4.2729 3.9348 3.4327 3.8737 3.8632 3.9768 3.8398 3.8968 4.0369 3.9170 3.9179 4.0608 3.8907 3.9754 0.9993 1.0233 1.0212 1.0123 0.9998 1.0036 1.0065 1.0084 0.9956 1.0141 1.0200 1.0248 1.0196 1.0182 1.0193 0.9915 1.0101 1.0041 1.0027 1.0086 1.0083 1.0092 1.0176
dispcorr: -0.029537547 hartree
energy: -1165.026481741240
dipole: 4.69553 -5.77276 -1.07724 -8.48831 8.58158 0.09327 9.47692 -8.85066 0.62626
magnitude: 1.24953 au
magnitude: 3.17606 debye
