program: Orca
programVersion: 4.2.1
elementType: O O O O N N N C C C C C C C C C C C C C C C C C C H H H H H H H H H H H H H H H H H H H H H H H
charge: 0
multiplicity: 1
keywords: wb97x-d3
keywords: def2-TZVPP
keywords: def2/J RIJCOSX GRIDX6 NOFINALGRIDX
keywords: grid4 nofinalgrid
keywords: scfconv7
keywords: smallprint printgap noloewdin
keywords: NOSOSCF
formula: C18H23N3O4
InChI: InChI=1S/C18H23N3O4/c1-3-5-6-11-25-17(22)16(4-2)21(13-15-8-7-12-24-15)18(23)20-10-9-19-14-20/h3,7-10,12,14,16H,1,4-6,11,13H2,2H3
48 atoms
O  -0.058217 -1.365815 -0.017998
O  -3.630992 0.32959 0.044494
O  -1.544181 -1.290972 1.655093
O  0.314326 3.259517 -1.345685
N  -0.451681 1.411374 -0.260435
N  1.84863 1.901887 -0.37227
N  3.701584 0.719916 -0.204562
C  -0.374194 0.726204 1.027847
C  -1.141711 1.443401 2.138787
C  -1.790424 1.682524 -0.792337
C  -0.763569 -0.749939 0.923619
C  0.520611 2.26563 -0.69676
C  -0.683754 2.883172 2.321516
C  -2.643091 0.467001 -0.865657
C  -0.260654 -2.769031 -0.211836
C  0.485629 -3.613747 0.803944
C  -2.650978 -0.595358 -1.709068
C  1.994807 -3.367824 0.85327
C  2.864507 2.799112 -0.128517
C  2.426212 0.661546 -0.42321
C  -3.704856 -1.447312 -1.27292
C  -4.257341 -0.830329 -0.202013
C  3.987349 2.045496 -0.008618
C  2.679522 -3.638223 -0.449715
C  3.528439 -2.818656 -1.056893
H  0.67665 0.722472 1.32885
H  -2.217256 1.401279 1.967796
H  -0.973233 0.887666 3.062462
H  -1.665575 2.090213 -1.793452
H  -2.298317 2.456482 -0.208826
H  -0.920354 3.512738 1.462577
H  -1.17231 3.329561 3.186925
H  0.393256 2.946121 2.490027
H  0.113213 -2.958745 -1.218268
H  -1.328559 -2.994973 -0.19356
H  0.299176 -4.659945 0.539476
H  0.051702 -3.472972 1.795093
H  -1.978431 -0.753396 -2.536224
H  2.413329 -4.028763 1.619258
H  2.214157 -2.350082 1.18507
H  2.688705 3.858335 -0.064085
H  1.861586 -0.227464 -0.653273
H  -4.011437 -2.38702 -1.700952
H  -5.071249 -1.089094 0.453991
H  4.989175 2.380733 0.205004
H  2.457369 -4.599213 -0.909152
H  3.998094 -3.092765 -1.992205
H  3.804328 -1.85494 -0.643388
totalener: -1164.99770328 hartree
nucrepener: 2389.70552015 hartree
electener: -3554.70322343 hartree
oneelecener: -6335.79497834 hartree
twoeener: 2781.09175491 hartree
kineticenergy: 1160.06892351 hartree
xcener: -111.464591980693 hartree
chargesum: -0.0000000
charge: -0.270185 -0.250074 -0.332176 -0.356424 -0.112938 -0.024781 -0.324086 -0.032542 -0.102242 -0.130521 0.316388 0.297202 -0.256413 0.243645 -0.025291 -0.153318 -0.277783 -0.079321 -0.125366 0.042844 -0.147319 0.005531 -0.074640 -0.162829 -0.252569 0.114449 0.082531 0.085689 0.127069 0.128713 0.077521 0.102156 0.080457 0.114167 0.120342 0.080174 0.100155 0.138173 0.088629 0.071127 0.159202 0.167892 0.145613 0.137986 0.129653 0.110026 0.097527 0.125958
qa: -0.2702 -0.2501 -0.3322 -0.3564 -0.1129 -0.0248 -0.3241 -0.0325 -0.1022 -0.1305 0.3164 0.2972 -0.2564 0.2436 -0.0253 -0.1533 -0.2778 -0.0793 -0.1254 0.0428 -0.1473 0.0055 -0.0746 -0.1628 -0.2526 0.1144 0.0825 0.0857 0.1271 0.1287 0.0775 0.1022 0.0805 0.1142 0.1203 0.0802 0.1002 0.1382 0.0886 0.0711 0.1592 0.1679 0.1456 0.1380 0.1297 0.1100 0.0975 0.1260
va: 2.0904 2.3168 2.1630 2.1437 3.0128 3.3086 3.0743 3.9541 3.9001 3.8850 4.2540 4.2829 3.9295 3.4323 3.8208 3.8825 3.9450 3.8679 3.9199 3.9299 3.9185 3.9258 4.0319 3.7908 3.9357 0.9973 1.0244 1.0194 1.0140 1.0067 1.0132 1.0071 1.0040 0.9987 1.0118 1.0117 1.0251 1.0131 1.0106 1.0165 1.0081 1.0185 1.0011 1.0025 1.0053 1.0040 1.0153 1.0290
dispcorr: -0.030221466 hartree
energy: -1165.027924750229
dipole: 4.03245 -4.97437 -0.94192 -10.30710 9.70954 -0.59755 6.66946 -6.37515 0.29431
magnitude: 1.15365 au
magnitude: 2.93234 debye
