program: Gaussian 09
title: 000003153
version: EM64L-G09RevD.01
frameworkgroup: C1[X(C10H13NO2)]
method: RPBEPBE
basis: SDD
operation: Freq
keyword: #p
keyword: freq=noraman
keyword: PBEPBE/SDD
title: #p freq=noraman PBEPBE/SDD
converged: YES YES NO NO
title: Mulliken charges:
elementType: O O N C C C C C C C C C C H H H H H H H H H H H H H
charge: -0.489452 -0.436595 -0.555527 -0.119392 -0.439744 -0.572981 -0.546626 0.335662 0.328227 -0.539251 -0.517038 0.149140 0.142393 0.226011 0.193622 0.233619 0.210457 0.208031 0.223089 0.220712 0.224996 0.256276 0.252972 0.260099 0.369854 0.381446
chargesum: 0.00000
title: Mulliken charges with hydrogens summed into heavy atoms:
elementType: O O N C C C C C C C C C C
charge: -0.119598 -0.055149 -0.042456 0.106620 -0.012504 -0.154493 -0.102825 0.335662 0.328227 -0.314255 -0.260762 0.149140 0.142393
polarizability: 1.64901283e+02 -8.14959772e-01 1.25872914e+02 -1.35889716e+00 -7.56512564e-01 6.92097204e+01
1716.lowfreq: 0.0002 0.0004 0.0009 4.6949 8.3672 20.3599 65.3155 100.7511 184.4542
frequency: 64.9222 100.7333 184.4528 195.9064 208.9141 245.7953 255.7596 271.8018 275.9055 321.9544 352.7246 374.0492 427.6034 430.1102 443.7961 482.9002 492.1994 544.0732 610.3339 627.0758 638.1039 701.8417 708.9392 740.6138 790.6909 823.4833 835.1799 874.6292 898.1394 922.2017 985.3497 1017.5840 1066.7472 1085.5570 1111.5864 1131.5405 1132.7753 1144.0053 1168.1832 1185.3901 1216.3989 1232.1403 1259.1310 1266.3105 1277.6727 1322.5277 1329.7353 1334.9975 1337.7192 1387.4786 1408.6419 1441.9612 1452.1682 1462.1778 1474.5788 1514.5370 1612.9906 1632.6581 1636.1093 2938.2828 2959.3764 2965.9147 2985.7494 3007.6548 3022.2322 3059.0497 3101.5762 3146.9366 3421.0989 3526.2596 3547.1080 3623.5146
redmass: 4.1202 3.3705 3.8298 2.3849 2.3632 1.5013 1.2590 2.0956 5.0781 3.7197 4.5092 4.1747 2.5450 4.0449 2.3650 1.1121 3.2513 4.0388 4.0850 4.6229 1.5114 3.9012 3.7916 5.7206 2.6617 1.7832 1.7753 1.4478 1.8574 1.7871 2.5364 1.6095 2.5900 2.8761 2.4044 1.6248 1.2259 1.3800 1.3449 1.9593 1.5748 1.6686 1.5933 1.4092 1.7251 1.6616 1.4538 2.0221 1.3669 1.5767 5.0062 2.4142 1.2668 1.1383 1.0943 3.4364 7.0518 7.0239 1.0953 1.0634 1.0667 1.0661 1.0840 1.0955 1.0947 1.0973 1.0909 1.0918 1.0445 1.0649 1.0963 1.0665
irintensity: 0.6381 0.3100 8.2306 6.6846 11.1050 47.9550 122.0118 37.5549 6.1263 20.5267 3.7075 3.3236 13.1944 5.8359 21.0302 126.3839 8.3160 1.7123 3.7752 9.2061 282.5278 5.4737 4.2855 18.5296 5.9842 19.1854 20.0631 11.4698 5.8863 15.8959 1.4190 6.3804 134.1559 30.8547 32.1632 80.8579 0.0238 2.2369 62.2882 9.2000 59.9389 46.8920 86.5735 15.0307 73.8370 14.1451 13.3730 5.2297 9.3081 4.8235 5.4724 18.7998 10.0876 9.4800 9.6481 136.7814 14.9967 6.1653 38.8213 39.7816 28.6752 22.0343 28.2946 48.7062 44.8853 45.7866 18.1498 5.6725 2.1209 81.1111 0.0442 48.4174
temp: 298.150 k
press: 1.00000 atm
elementType: 8 8 7 6 6 6 6 6 6 6 6 6 6 1 1 1 1 1 1 1 1 1 1 1 1 1
symmnumber: 1
zpe: 560918.4 jmol-1
zpe.correction: 0.213643 hartree
zpe.thermalcorrener: 0.225729 hartree
zpe.thermalcorrenthalpy: 0.226674 hartree
zpe.thermalcorrgfe: 0.176435 hartree
zpe.sumelectzpe: -593.084483 hartree
zpe.sumelectthermal: -593.072396 hartree
zpe.sumelectthermalent: -593.071452 hartree
zpe.sumelectthermalfe: -593.121690 hartree
dipole: -0.4963 -3.6563 0.5384
dipole: 3.7289
quadrupole: -82.2675 -66.5061 -78.5451
quadrupole: -5.1984 -2.4934 -0.0519
quadrupole: -6.4946 9.2668 -2.7722 -5.1984 -2.4934 -0.0519
hfenergy: -593.2981256 hartree
pointgroup: C01 [X(C10H13N1O2)]
dipole: -0.1909571 1.4385422 -0.2153921 debye
dipolederiv: -1.0966539 -0.6020891 0.0088315 -0.6800335 -0.5591721 -0.0085167 0.0081095 -0.0104163 -0.4332861 -1.4020287 0.3777331 -0.0286123 0.459192 -0.2634115 0.0033166 -0.0264129 0.0001061 -0.4149339 -1.0158329 -0.0127782 0.0820184 -0.1332405 -0.3797874 0.0981017 0.1442154 0.0657632 -0.1969369 0.7055739 -0.0562637 -0.0271833 -0.0320414 0.2573284 -0.0650237 -0.0582108 -0.0588009 0.2118043 0.0202552 0.0457228 -0.0217099 0.0315766 -0.0440157 -0.0410777 0.0544156 -0.0289782 0.1568631 -0.1291357 -0.0098128 0.0240074 -0.072573 0.0466749 0.042981 0.0062994 0.0527938 0.1560379 0.0768677 0.0022883 -0.0075291 -0.0281531 0.0738262 0.0080535 0.0608676 0.0336098 0.1645836 0.0409554 -0.0518967 0.0278175 -0.3227561 -0.0417434 -0.0030412 0.1495668 -0.0232329 -0.0619219 0.04656 0.042825 -0.023684 0.3085743 0.1095495 -0.0012828 -0.1250728 -0.0378207 -0.0730467 -0.1667088 -0.0627562 0.0044754 0.0549791 0.0182038 -0.0153362 -0.0165362 -0.0124086 -0.180602 -0.2137884 0.0740487 -0.0006499 -0.138174 0.0674091 -0.0198593 0.0147478 -0.0083562 -0.1739629 0.6367457 0.5049659 -0.0011847 0.9434337 0.4186211 0.0092097 -0.0179382 0.0052218 0.007552 1.1620996 -0.3427323 0.023653 -0.7097944 0.0739556 -0.0103709 0.0354774 -0.0021649 0.056898 0.0104506 0.010576 -0.0316465 -0.0208752 0.0245437 0.0359814 -0.0156157 0.0248059 -0.1690627 0.0690194 0.0182507 0.0005599 0.0576356 0.0419357 0.0742902 -0.0461301 0.0127262 -0.1797729 -0.1117413 -0.132449 0.016047 -0.1225304 -0.0163493 0.0179434 0.0353168 0.0316845 0.071646 -0.0020083 -0.0018332 -0.005724 0.0283549 -0.1384155 -0.0931716 0.0420597 -0.126394 0.016422 -0.0638204 0.0665314 -0.0647614 0.0438241 0.044383 0.0351623 -0.0882015 0.0954313 -0.1274593 -0.0035624 0.0546729 0.0302917 0.013772 -0.1107862 -0.0901643 -0.0103907 -0.1317864 0.0246758 -0.0313395 -0.064147 0.0176576 -0.0469804 0.0274457 0.0574987 0.0276766 0.117667 -0.1161391 0.0727953 0.0083372 -0.0005208 -0.0182771 -0.1307499 0.008901 0.0021008 0.0051468 0.1598301 0.0927576 0.0031596 -0.0017348 0.0317725 -0.0677251 0.0076478 -0.0035925 0.0034245 0.156991 0.2782782 0.0469737 0.0664654 0.125565 0.196905 0.0522371 -0.0618232 0.036904 -0.0256547 0.2794578 -0.0020431 -0.0834411 0.1669975 -0.0150863 -0.117129 -0.1075697 -0.0586516 0.1822939 0.3196723 0.1772212 -0.0068775 0.1362103 0.1747818 0.0088059 -0.005609 0.0093698 0.3989024 0.4251316 -0.0945051 0.0034346 -0.0764586 0.1916789 0.0048431 0.00225 0.0043558 0.3882791 unknown
polarizability: 164.8804547|0.7476601|125.8674237|2.0295771|-0.841723|69.236039 unknown
InChI: InChI=1S/C10H13NO2/c11-8-2-1-6-4-9(12)10(13)5-7(6)3-8/h4-5,8,12-13H,1-3,11H2
charge 0 multiplicity 1
26 atoms
O  3.363767 1.550759 -0.007118
O  3.572553 -1.146024 0.067486
N  -4.188606 0.852489 0.065122
C  -2.838137 0.304624 0.324991
C  -2.681841 -1.064353 -0.36885
C  -1.681321 1.238119 -0.130973
C  -1.365093 -1.750464 0.053153
C  -0.301396 0.58879 -0.047577
C  -0.151244 -0.824456 0.001137
C  0.858744 1.408815 -0.047707
C  1.150186 -1.388871 0.038731
C  2.138604 0.835455 -0.00945
C  2.293462 -0.575033 0.032931
H  -2.756471 0.144805 1.419225
H  -2.69468 -0.911889 -1.468947
H  -3.548938 -1.698764 -0.111809
H  -1.698932 2.173282 0.464807
H  -1.889202 1.535773 -1.182326
H  -1.181801 -2.640682 -0.578654
H  -1.477971 -2.131128 1.090004
H  0.746642 2.501521 -0.080441
H  1.287888 -2.474955 0.074364
H  -4.388545 0.957111 -0.937872
H  -4.383849 1.724808 0.570782
H  3.217868 2.525876 -0.039149
H  4.244914 -0.414708 0.056339
