program: Orca
programVersion: 4.2.1
elementType: O O O O N N N C C C C C C C C C C C C C C C C C C H H H H H H H H H H H H H H H H H H H H H H H
charge: 0
multiplicity: 1
keywords: wb97x-d3
keywords: def2-TZVPP
keywords: def2/J RIJCOSX GRIDX6 NOFINALGRIDX
keywords: grid4 nofinalgrid
keywords: scfconv7
keywords: smallprint printgap noloewdin
keywords: NOSOSCF
formula: C18H23N3O4
InChI: InChI=1S/C18H23N3O4/c1-3-5-6-11-25-17(22)16(4-2)21(13-15-8-7-12-24-15)18(23)20-10-9-19-14-20/h3,7-10,12,14,16H,1,4-6,11,13H2,2H3
48 atoms
O  0.063399 -1.090148 0.216573
O  -3.609358 0.265596 0.139697
O  -1.400899 -1.089196 1.910182
O  0.178694 1.264298 -2.24134
N  -0.499429 1.604209 -0.089738
N  1.779032 1.494705 -0.658285
N  3.948486 1.105396 -0.73675
C  -0.342493 0.986138 1.229838
C  -1.139443 1.690749 2.319963
C  -1.868201 1.802476 -0.565051
C  -0.654301 -0.513421 1.171409
C  0.432618 1.422124 -1.074436
C  -0.773446 3.160057 2.464544
C  -2.655001 0.554356 -0.772866
C  -0.154702 -2.48309 -0.035169
C  0.812821 -2.913929 -1.114332
C  -2.617059 -0.417657 -1.718192
C  2.283885 -2.876151 -0.689244
C  2.357639 2.302165 0.29908
C  2.799793 0.813241 -1.25793
C  -3.611877 -1.369748 -1.351198
C  -4.175012 -0.898732 -0.214018
C  3.688695 2.041777 0.22762
C  2.581814 -3.816395 0.434448
C  3.033709 -3.455409 1.628044
H  0.712202 1.053964 1.506939
H  -2.211868 1.569854 2.162139
H  -0.931958 1.172073 3.256696
H  -1.814422 2.361993 -1.496499
H  -2.387079 2.442083 0.149425
H  0.278841 3.284524 2.72655
H  -0.954324 3.728088 1.551144
H  -1.35793 3.623822 3.258228
H  -1.188888 -2.626835 -0.355744
H  -0.002011 -3.053639 0.883775
H  0.665296 -2.295808 -2.00413
H  0.543926 -3.933972 -1.404689
H  -1.954262 -0.444003 -2.566747
H  2.575765 -1.861948 -0.40975
H  2.897495 -3.14385 -1.554824
H  1.789751 3.00179 0.887072
H  2.621062 0.115047 -2.060065
H  -3.87456 -2.277615 -1.868132
H  -4.956977 -1.270571 0.426395
H  4.4794 2.485455 0.811173
H  2.396304 -4.869971 0.239231
H  3.229303 -4.180902 2.405896
H  3.232982 -2.418253 1.868989
totalener: -1164.99808570 hartree
nucrepener: 2409.79065985 hartree
electener: -3574.78874555 hartree
oneelecener: -6375.96551174 hartree
twoeener: 2801.17676619 hartree
kineticenergy: 1160.08634968 hartree
xcener: -111.465141878746 hartree
chargesum: -0.0000000
charge: -0.260439 -0.250198 -0.324570 -0.369690 -0.135551 0.003521 -0.300196 0.027083 -0.073527 -0.111899 0.253137 0.325982 -0.275269 0.210157 -0.048059 -0.140068 -0.275713 -0.056188 -0.181114 0.033085 -0.150798 0.001223 -0.078169 -0.196666 -0.196823 0.117433 0.078785 0.086731 0.129065 0.125882 0.071061 0.083973 0.104925 0.119233 0.124078 0.084557 0.080419 0.152931 0.074600 0.092520 0.182722 0.152641 0.144911 0.138622 0.132092 0.104070 0.104434 0.085066
qa: -0.2604 -0.2502 -0.3246 -0.3697 -0.1356 0.0035 -0.3002 0.0271 -0.0735 -0.1119 0.2531 0.3260 -0.2753 0.2102 -0.0481 -0.1401 -0.2757 -0.0562 -0.1811 0.0331 -0.1508 0.0012 -0.0782 -0.1967 -0.1968 0.1174 0.0788 0.0867 0.1291 0.1259 0.0711 0.0840 0.1049 0.1192 0.1241 0.0846 0.0804 0.1529 0.0746 0.0925 0.1827 0.1526 0.1449 0.1386 0.1321 0.1041 0.1044 0.0851
va: 2.1219 2.3117 2.1764 2.1228 2.9899 3.2504 3.1062 3.9260 3.8646 3.9369 4.3173 4.2751 3.9345 3.4009 3.8366 3.8911 3.9666 3.8606 3.8971 4.0280 3.9072 3.9281 4.0664 3.8839 3.9542 1.0014 1.0228 1.0192 1.0107 0.9988 1.0033 1.0065 1.0083 1.0032 1.0120 1.0195 1.0150 1.0194 1.0268 1.0066 0.9898 1.0006 1.0017 1.0026 1.0087 1.0089 1.0080 1.0158
dispcorr: -0.030448242 hartree
energy: -1165.028533943616
dipole: 3.46476 -4.42228 -0.95752 -6.63270 6.66762 0.03492 7.89230 -7.36928 0.52302
magnitude: 1.09161 au
magnitude: 2.77465 debye
