program: Orca
programVersion: 4.2.1
elementType: O O O O N N N C C C C C C C C C C C C C C C C C C H H H H H H H H H H H H H H H H H H H H H H H
charge: 0
multiplicity: 1
keywords: wb97x-d3
keywords: def2-TZVPP
keywords: def2/J RIJCOSX GRIDX6 NOFINALGRIDX
keywords: grid4 nofinalgrid
keywords: scfconv7
keywords: smallprint printgap noloewdin
keywords: NOSOSCF
formula: C18H23N3O4
InChI: InChI=1S/C18H23N3O4/c1-3-5-6-11-25-17(22)16(4-2)21(13-15-8-7-12-24-15)18(23)20-10-9-19-14-20/h3,7-10,12,14,16H,1,4-6,11,13H2,2H3
48 atoms
O  0.0701 -2.63204 0.81555
O  -3.882117 0.454097 -0.010381
O  0.379692 -1.913127 -1.283518
O  -0.359713 2.613508 -1.626619
N  -0.546283 0.57965 -0.646055
N  1.486095 1.761585 -0.609546
N  3.627396 1.252504 -0.486916
C  -0.162754 -0.313496 0.431763
C  -1.119442 -0.274295 1.628407
C  -1.832458 0.370322 -1.310809
C  0.115164 -1.706371 -0.130138
C  0.122977 1.704313 -0.999239
C  -1.259833 1.125778 2.20709
C  -2.990434 1.137892 -0.766038
C  0.476184 -3.970107 0.512588
C  1.886254 -4.26446 0.992582
C  -3.387589 2.429913 -0.877117
C  2.992606 -3.456023 0.317538
C  2.124517 2.877861 -0.122001
C  2.453968 0.821184 -0.828557
C  -4.59584 2.545543 -0.130225
C  -4.842689 1.314241 0.371349
C  3.435565 2.530528 -0.035267
C  3.271999 -2.081572 0.850207
C  2.818748 -1.531839 1.970566
H  0.807618 0.013631 0.816259
H  -2.097091 -0.680707 1.366893
H  -0.712753 -0.935662 2.393518
H  -2.058841 -0.695604 -1.274691
H  -1.704297 0.616019 -2.364444
H  -1.871621 1.102976 3.108244
H  -0.286905 1.53749 2.484002
H  -1.73059 1.821991 1.513885
H  0.386033 -4.159706 -0.557989
H  -0.23592 -4.612576 1.031969
H  2.052902 -5.324907 0.783692
H  1.944792 -4.168566 2.079602
H  -2.87408 3.203916 -1.420257
H  2.791672 -3.385609 -0.756039
H  3.929892 -4.018787 0.386632
H  1.593335 3.78306 0.114126
H  2.229132 -0.139077 -1.265572
H  -5.198092 3.427784 0.008411
H  -5.634594 0.91459 0.982676
H  4.25566 3.130628 0.324398
H  3.960469 -1.493772 0.250105
H  3.137581 -0.537736 2.255051
H  2.135482 -2.031373 2.645323
totalener: -1164.99707483 hartree
nucrepener: 2368.99085471 hartree
electener: -3533.98792954 hartree
oneelecener: -6294.64519069 hartree
twoeener: 2760.65726115 hartree
kineticenergy: 1160.06431368 hartree
xcener: -111.466970262894 hartree
chargesum: -0.0000000
charge: -0.258562 -0.260000 -0.359448 -0.376865 -0.085624 -0.024040 -0.315565 0.024388 -0.109481 -0.076909 0.279086 0.330537 -0.275626 0.132418 -0.029879 -0.124334 -0.205831 -0.060047 -0.118065 0.009138 -0.138631 -0.026387 -0.080318 -0.175434 -0.253493 0.105417 0.085654 0.087257 0.118692 0.129391 0.098863 0.086696 0.094361 0.106358 0.102421 0.083664 0.075407 0.156397 0.082787 0.093148 0.154503 0.173096 0.139185 0.140184 0.129951 0.130741 0.122016 0.082784
qa: -0.2586 -0.2600 -0.3594 -0.3769 -0.0856 -0.0240 -0.3156 0.0244 -0.1095 -0.0769 0.2791 0.3305 -0.2756 0.1324 -0.0299 -0.1243 -0.2058 -0.0600 -0.1181 0.0091 -0.1386 -0.0264 -0.0803 -0.1754 -0.2535 0.1054 0.0857 0.0873 0.1187 0.1294 0.0989 0.0867 0.0944 0.1064 0.1024 0.0837 0.0754 0.1564 0.0828 0.0931 0.1545 0.1731 0.1392 0.1402 0.1300 0.1307 0.1220 0.0828
va: 2.1356 2.2809 2.1176 2.1255 3.0863 3.2818 3.0757 3.9241 3.8240 3.9078 4.2209 4.2645 3.9340 3.4689 3.9031 3.8783 3.9950 3.8417 3.9105 3.9865 3.9499 3.9032 4.0157 3.7930 3.9107 1.0073 1.0270 1.0252 1.0151 1.0058 1.0074 1.0045 1.0102 1.0145 0.9993 1.0150 1.0103 1.0199 1.0189 0.9989 1.0085 1.0043 1.0042 1.0030 1.0063 1.0136 1.0110 1.0208
dispcorr: -0.030694827 hartree
energy: -1165.027769655467
dipole: 4.35043 -5.33549 -0.98507 -12.17093 11.02412 -1.14681 13.56880 -12.30841 1.26039
magnitude: 1.96828 au
magnitude: 5.00296 debye
