program: Orca
programVersion: 4.2.1
elementType: O O O O N N N C C C C C C C C C C C C C C C C C C H H H H H H H H H H H H H H H H H H H H H H H
charge: 0
multiplicity: 1
keywords: wb97x-d3
keywords: def2-TZVPP
keywords: def2/J RIJCOSX GRIDX6 NOFINALGRIDX
keywords: grid4 nofinalgrid
keywords: scfconv7
keywords: smallprint printgap noloewdin
keywords: NOSOSCF
formula: C18H23N3O4
InChI: InChI=1S/C18H23N3O4/c1-3-5-6-11-25-17(22)16(4-2)21(13-15-8-7-12-24-15)18(23)20-10-9-19-14-20/h3,7-10,12,14,16H,1,4-6,11,13H2,2H3
48 atoms
O  1.268156 -1.803519 2.069708
O  -2.929551 1.636303 -0.547699
O  1.22955 -1.536485 -0.151329
O  0.801185 2.770791 0.699855
N  -0.122427 0.800771 0.023186
N  0.37742 2.477065 -1.516108
N  0.764811 2.497642 -3.685526
C  0.199289 0.129826 1.26838
C  -0.996983 -0.064517 2.209661
C  -1.043798 0.145038 -0.908566
C  0.944553 -1.163579 0.954083
C  0.37567 2.051552 -0.167665
C  -1.590414 1.252851 2.683864
C  -2.114862 1.028107 -1.43546
C  1.982003 -3.040243 1.964199
C  1.049241 -4.210683 1.712873
C  -2.484282 1.351085 -2.697092
C  1.808966 -5.539535 1.692606
C  0.017565 3.725209 -1.961842
C  0.83232 1.786689 -2.604794
C  -3.607175 2.221919 -2.573946
C  -3.825359 2.359974 -1.247579
C  0.244593 3.704709 -3.301213
C  2.421662 -5.882847 3.013994
C  3.716569 -6.067457 3.233266
H  0.911653 0.771045 1.795273
H  -1.769334 -0.672827 1.72997
H  -0.65792 -0.638608 3.071997
H  -1.495764 -0.686227 -0.363813
H  -0.525982 -0.31122 -1.751092
H  -1.993567 1.839759 1.862261
H  -2.403561 1.067532 3.385518
H  -0.843005 1.86236 3.191743
H  2.494328 -3.150821 2.919338
H  2.739616 -2.975629 1.18005
H  0.538051 -4.077772 0.757546
H  0.278965 -4.237559 2.489294
H  -1.996602 1.036571 -3.60513
H  2.578566 -5.518253 0.91574
H  1.107667 -6.32894 1.406742
H  -0.373903 4.477522 -1.300018
H  1.240179 0.790178 -2.523181
H  -4.164796 2.687143 -3.369071
H  -4.547512 2.917403 -0.674409
H  0.065649 4.493614 -4.013539
H  1.728462 -5.977857 3.846514
H  4.096933 -6.314779 4.214931
H  4.447233 -5.981972 2.437651
totalener: -1164.99770571 hartree
nucrepener: 2264.87760551 hartree
electener: -3429.87531121 hartree
oneelecener: -6086.24894645 hartree
twoeener: 2656.37363524 hartree
kineticenergy: 1160.08132544 hartree
xcener: -111.465168898108 hartree
chargesum: 0.0000000
charge: -0.273134 -0.273296 -0.371940 -0.362718 -0.102355 -0.015213 -0.287537 0.035739 -0.115397 -0.137171 0.328975 0.327069 -0.257376 0.237248 0.017757 -0.136233 -0.254928 -0.089423 -0.097714 -0.016871 -0.134164 -0.032614 -0.088448 -0.178052 -0.206426 0.111026 0.066121 0.089876 0.121299 0.144918 0.083223 0.089924 0.090224 0.112491 0.094461 0.094464 0.071950 0.146583 0.076418 0.087254 0.148379 0.150638 0.137848 0.140608 0.123648 0.110762 0.106515 0.085593
qa: -0.2731 -0.2733 -0.3719 -0.3627 -0.1024 -0.0152 -0.2875 0.0357 -0.1154 -0.1372 0.3290 0.3271 -0.2574 0.2372 0.0178 -0.1362 -0.2549 -0.0894 -0.0977 -0.0169 -0.1342 -0.0326 -0.0884 -0.1781 -0.2064 0.1110 0.0661 0.0899 0.1213 0.1449 0.0832 0.0899 0.0902 0.1125 0.0945 0.0945 0.0719 0.1466 0.0764 0.0873 0.1484 0.1506 0.1378 0.1406 0.1236 0.1108 0.1065 0.0856
va: 2.1485 2.2880 2.1098 2.1427 3.0005 3.2580 3.1106 3.8701 3.8779 3.8478 4.2316 4.2839 3.9392 3.4200 3.8449 3.8527 3.9829 3.9088 3.9047 4.0658 3.9773 3.9265 4.0230 3.8399 3.9576 1.0420 1.0128 1.0257 0.9989 1.0000 1.0207 1.0035 1.0081 1.0096 1.0150 1.0238 1.0135 1.0172 1.0118 1.0074 1.0104 1.0069 1.0051 1.0031 1.0101 1.0077 1.0087 1.0149
dispcorr: -0.026493989 hartree
energy: -1165.024199694685
dipole: 1.57755 -2.57608 -0.99853 -23.22954 21.90465 -1.32489 16.49458 -15.38461 1.10997
magnitude: 1.99611 au
magnitude: 5.07370 debye
