program: Orca
programVersion: 4.2.1
elementType: O O O O N N N C C C C C C C C C C C C C C C C C C H H H H H H H H H H H H H H H H H H H H H H H
charge: 0
multiplicity: 1
keywords: wb97x-d3
keywords: def2-TZVPP
keywords: def2/J RIJCOSX GRIDX6 NOFINALGRIDX
keywords: grid4 nofinalgrid
keywords: scfconv7
keywords: smallprint printgap noloewdin
keywords: NOSOSCF
formula: C18H23N3O4
InChI: InChI=1S/C18H23N3O4/c1-3-5-6-11-25-17(22)16(4-2)21(13-15-8-7-12-24-15)18(23)20-10-9-19-14-20/h3,7-10,12,14,16H,1,4-6,11,13H2,2H3
48 atoms
O  0.130711 -0.926185 0.280832
O  -3.625932 0.384158 0.052208
O  -1.433472 -0.788641 1.87609
O  0.162503 1.187773 -2.419894
N  -0.515064 1.717537 -0.306369
N  1.761238 1.58266 -0.86603
N  3.92961 1.181941 -0.873927
C  -0.340718 1.22775 1.064521
C  -1.128234 2.038691 2.086929
C  -1.889987 1.856861 -0.784196
C  -0.64537 -0.272872 1.135776
C  0.415361 1.455361 -1.273266
C  -0.606857 1.846044 3.505057
C  -2.659225 0.583334 -0.870696
C  -0.040777 -2.342447 0.159145
C  1.032971 -2.851797 -0.779703
C  -2.593298 -0.486255 -1.702837
C  2.454504 -2.717015 -0.245181
C  2.328174 2.476915 0.017945
C  2.787026 0.84254 -1.380057
C  -3.58325 -1.405407 -1.248976
C  -4.171179 -0.819652 -0.179769
C  3.659435 2.208358 -0.009293
C  2.82132 -3.605433 0.904832
C  2.141821 -4.646161 1.369921
H  0.717046 1.323685 1.318597
H  -1.040944 3.093938 1.813859
H  -2.188117 1.783987 2.052176
H  -1.852645 2.335261 -1.760989
H  -2.40937 2.547222 -0.11902
H  -1.153644 2.481672 4.200612
H  -0.723508 0.81809 3.841981
H  0.449339 2.111053 3.581548
H  -1.038127 -2.544381 -0.239036
H  0.029641 -2.806406 1.144297
H  0.951071 -2.318633 -1.730844
H  0.814259 -3.898144 -1.00878
H  -1.918413 -0.596846 -2.534934
H  2.650529 -1.678818 0.037635
H  3.160695 -2.915122 -1.058934
H  1.753993 3.230027 0.529511
H  2.615898 0.066909 -2.109349
H  -3.827032 -2.367901 -1.666995
H  -4.959799 -1.129121 0.485164
H  4.443184 2.705605 0.539155
H  3.765395 -3.359242 1.381387
H  2.516538 -5.230552 2.198788
H  1.194544 -4.96706 0.954709
totalener: -1164.99605577 hartree
nucrepener: 2399.66946059 hartree
electener: -3564.66551635 hartree
oneelecener: -6355.73383406 hartree
twoeener: 2791.06831771 hartree
kineticenergy: 1160.07958401 hartree
xcener: -111.464614738719 hartree
chargesum: -0.0000000
charge: -0.265889 -0.249001 -0.332232 -0.367247 -0.149733 0.003327 -0.302596 0.103635 -0.099398 -0.104522 0.228693 0.327961 -0.276955 0.213410 -0.048802 -0.131632 -0.284268 -0.078515 -0.177896 0.034561 -0.141057 -0.000164 -0.068332 -0.147832 -0.237925 0.105041 0.078208 0.084327 0.130035 0.125646 0.091577 0.103736 0.072276 0.114937 0.124396 0.087712 0.080637 0.152882 0.085610 0.091597 0.171155 0.147848 0.144939 0.137414 0.131256 0.109054 0.103899 0.078224
qa: -0.2659 -0.2490 -0.3322 -0.3672 -0.1497 0.0033 -0.3026 0.1036 -0.0994 -0.1045 0.2287 0.3280 -0.2770 0.2134 -0.0488 -0.1316 -0.2843 -0.0785 -0.1779 0.0346 -0.1411 -0.0002 -0.0683 -0.1478 -0.2379 0.1050 0.0782 0.0843 0.1300 0.1256 0.0916 0.1037 0.0723 0.1149 0.1244 0.0877 0.0806 0.1529 0.0856 0.0916 0.1712 0.1478 0.1449 0.1374 0.1313 0.1091 0.1039 0.0782
va: 2.1292 2.3141 2.1552 2.1245 3.0306 3.2526 3.0996 3.8969 3.8634 3.9289 4.2694 4.2823 3.9553 3.3943 3.8386 3.8989 3.9587 3.8680 3.8991 4.0343 3.9098 3.9298 4.0540 3.8698 3.9482 1.0066 1.0091 1.0178 1.0094 1.0006 1.0039 1.0122 1.0027 0.9997 1.0110 1.0205 1.0139 1.0195 1.0157 1.0029 0.9952 1.0026 1.0010 1.0027 1.0080 1.0059 1.0143 1.0135
dispcorr: -0.029776252 hartree
energy: -1165.025832017494
dipole: 3.66397 -4.48401 -0.82004 -10.19804 10.34862 0.15059 11.03005 -10.45176 0.57829
magnitude: 1.01467 au
magnitude: 2.57909 debye
