program: Orca
programVersion: 4.2.1
elementType: O O O O N N N C C C C C C C C C C C C C C C C C C H H H H H H H H H H H H H H H H H H H H H H H
charge: 0
multiplicity: 1
keywords: wb97x-d3
keywords: def2-TZVPP
keywords: def2/J RIJCOSX GRIDX6 NOFINALGRIDX
keywords: grid4 nofinalgrid
keywords: scfconv7
keywords: smallprint printgap noloewdin
keywords: NOSOSCF
formula: C18H23N3O4
InChI: InChI=1S/C18H23N3O4/c1-3-5-6-11-25-17(22)16(4-2)21(13-15-8-7-12-24-15)18(23)20-10-9-19-14-20/h3,7-10,12,14,16H,1,4-6,11,13H2,2H3
48 atoms
O  0.016215 -1.31299 1.38426
O  -2.664917 -1.011299 -0.460272
O  -1.307133 -0.51186 2.999341
O  0.082326 2.229524 -1.743742
N  -0.37926 1.208659 0.221319
N  1.84721 1.601334 -0.465652
N  3.962427 2.225393 -0.525422
C  -0.046655 1.028381 1.628502
C  -0.564179 2.159338 2.51534
C  -1.801543 1.228569 -0.130249
C  -0.537964 -0.3407 2.096403
C  0.459935 1.707599 -0.723751
C  -0.051431 3.521634 2.072451
C  -2.203109 0.122029 -1.036771
C  -0.358759 -2.6603 1.690873
C  0.513596 -3.613413 0.903624
C  -2.211327 -0.012232 -2.384968
C  0.285634 -3.661447 -0.611332
C  2.584122 0.53278 0.00464
C  2.745708 2.581561 -0.786815
C  -2.711601 -1.319982 -2.653939
C  -2.969177 -1.874137 -1.447782
C  3.877131 0.94721 -0.044326
C  0.721207 -2.439123 -1.358967
C  1.813575 -2.377799 -2.10948
H  1.04089 1.020925 1.722012
H  -1.655064 2.159948 2.557602
H  -0.234849 1.954662 3.535795
H  -2.054765 2.183838 -0.589802
H  -2.378527 1.160329 0.792227
H  -0.446374 3.815619 1.099348
H  -0.35031 4.290593 2.783706
H  1.038122 3.542785 2.008818
H  -1.415917 -2.802772 1.45242
H  -0.236904 -2.8370 2.761914
H  0.313835 -4.609978 1.307871
H  1.566794 -3.408638 1.114404
H  -1.891668 0.730362 -3.096292
H  -0.775513 -3.848912 -0.804939
H  0.82555 -4.527431 -1.002074
H  2.138536 -0.412454 0.26127
H  2.430903 3.529581 -1.193526
H  -2.859024 -1.78035 -3.616255
H  -3.370073 -2.828581 -1.149049
H  4.756528 0.387446 0.2310
H  0.094468 -1.558419 -1.275284
H  2.093789 -1.472166 -2.630039
H  2.465666 -3.233665 -2.240959
totalener: -1164.99713687 hartree
nucrepener: 2417.97758932 hartree
electener: -3582.97472619 hartree
oneelecener: -6392.04593074 hartree
twoeener: 2809.07120454 hartree
kineticenergy: 1160.07942887 hartree
xcener: -111.461804345342 hartree
chargesum: -0.0000000
charge: -0.253822 -0.258173 -0.331670 -0.368491 -0.081653 0.008513 -0.295303 -0.055156 -0.093133 -0.069936 0.331582 0.275877 -0.270731 0.123656 -0.040145 -0.103809 -0.203836 -0.074979 -0.193288 0.049088 -0.129030 -0.050791 -0.073367 -0.155583 -0.215810 0.119569 0.075935 0.084333 0.137143 0.127245 0.082768 0.103181 0.087306 0.099741 0.113740 0.083186 0.074883 0.154509 0.071554 0.082477 0.176146 0.144319 0.136898 0.147623 0.130528 0.107543 0.112910 0.076450
qa: -0.2538 -0.2582 -0.3317 -0.3685 -0.0817 0.0085 -0.2953 -0.0552 -0.0931 -0.0699 0.3316 0.2759 -0.2707 0.1237 -0.0401 -0.1038 -0.2038 -0.0750 -0.1933 0.0491 -0.1290 -0.0508 -0.0734 -0.1556 -0.2158 0.1196 0.0759 0.0843 0.1371 0.1272 0.0828 0.1032 0.0873 0.0997 0.1137 0.0832 0.0749 0.1545 0.0716 0.0825 0.1761 0.1443 0.1369 0.1476 0.1305 0.1075 0.1129 0.0764
va: 2.1228 2.2721 2.1721 2.1322 2.9626 3.2131 3.1405 3.9891 3.8874 3.8558 4.2150 4.2854 3.9420 3.4939 3.8891 3.8647 3.9864 3.8622 3.8861 4.0400 3.9479 3.8913 4.0771 3.8267 3.9716 1.0014 1.0175 1.0194 1.0088 1.0208 1.0058 1.0080 1.0032 1.0005 1.0082 1.0122 1.0212 1.0154 1.0190 1.0142 1.0015 1.0084 1.0068 1.0014 1.0107 0.9817 1.0061 1.0158
dispcorr: -0.031822441 hartree
energy: -1165.028959315395
dipole: 0.39077 -1.29501 -0.90423 -7.90469 6.74603 -1.15867 3.83365 -3.25884 0.57480
magnitude: 1.57815 au
magnitude: 4.01133 debye
