program: Orca
programVersion: 4.2.1
elementType: O O O O N N N C C C C C C C C C C C C C C C C C C H H H H H H H H H H H H H H H H H H H H H H H
charge: 0
multiplicity: 1
keywords: wb97x-d3
keywords: def2-TZVPP
keywords: def2/J RIJCOSX GRIDX6 NOFINALGRIDX
keywords: grid4 nofinalgrid
keywords: scfconv7
keywords: smallprint printgap noloewdin
keywords: NOSOSCF
formula: C18H23N3O4
InChI: InChI=1S/C18H23N3O4/c1-3-5-6-11-25-17(22)16(4-2)21(13-15-8-7-12-24-15)18(23)20-10-9-19-14-20/h3,7-10,12,14,16H,1,4-6,11,13H2,2H3
48 atoms
O  -0.355675 -1.252224 0.768516
O  -1.857774 -0.105093 -1.988373
O  -1.750784 -0.778595 2.450707
O  0.027706 3.099943 -1.333709
N  -0.63408 1.502744 0.153792
N  1.632326 1.821791 -0.363232
N  3.429603 0.544499 -0.35549
C  -0.395809 0.982808 1.495553
C  -0.938128 1.898144 2.593871
C  -2.024698 1.594226 -0.275128
C  -0.938213 -0.441918 1.636493
C  0.286557 2.214625 -0.561433
C  -0.415487 3.321975 2.479936
C  -2.500365 0.325336 -0.885378
C  -0.705595 -2.641142 0.764605
C  0.306139 -3.349498 -0.109541
C  -3.495255 -0.53573 -0.563094
C  1.725234 -3.331881 0.465546
C  2.715221 2.671255 -0.378639
C  2.134683 0.548368 -0.369422
C  -3.459352 -1.570528 -1.54578
C  -2.440846 -1.253198 -2.377349
C  3.805492 1.862134 -0.347788
C  2.729146 -3.914012 -0.47811
C  3.728433 -3.230742 -1.020957
H  0.684529 0.91341 1.639195
H  -2.029435 1.893284 2.607959
H  -0.637808 1.470165 3.552008
H  -2.11669 2.421584 -0.97848
H  -2.667868 1.83493 0.572774
H  -0.795987 3.833954 1.595641
H  -0.719383 3.9090 3.345854
H  0.675307 3.350406 2.436022
H  -1.718507 -2.749325 0.371473
H  -0.693032 -3.032158 1.78529
H  0.29865 -2.90373 -1.108121
H  -0.027456 -4.383364 -0.236251
H  -4.164275 -0.452027 0.277441
H  1.729194 -3.894508 1.40582
H  2.024268 -2.3124 0.717705
H  2.603157 3.740794 -0.405041
H  1.495002 -0.317068 -0.419591
H  -4.104738 -2.429843 -1.618178
H  -2.036486 -1.726022 -3.256914
H  4.843321 2.152231 -0.325463
H  2.600786 -4.962726 -0.733807
H  4.419609 -3.697734 -1.709875
H  3.893817 -2.181496 -0.800558
totalener: -1164.99876447 hartree
nucrepener: 2383.53951252 hartree
electener: -3548.53827699 hartree
oneelecener: -6323.25365528 hartree
twoeener: 2774.71537829 hartree
kineticenergy: 1160.08101240 hartree
xcener: -111.462873849338 hartree
chargesum: -0.0000000
charge: -0.252809 -0.250639 -0.328983 -0.348656 -0.117209 -0.022109 -0.327699 -0.021269 -0.126006 -0.100303 0.298719 0.296173 -0.252589 0.221304 -0.057332 -0.117480 -0.246217 -0.073559 -0.127729 0.048436 -0.171384 -0.029340 -0.069782 -0.178057 -0.212902 0.124673 0.074531 0.086318 0.136333 0.132311 0.085187 0.102132 0.080067 0.127104 0.115786 0.085145 0.083407 0.141016 0.084032 0.068253 0.157631 0.160707 0.143877 0.145250 0.128595 0.102995 0.096552 0.105518
qa: -0.2528 -0.2506 -0.3290 -0.3487 -0.1172 -0.0221 -0.3277 -0.0213 -0.1260 -0.1003 0.2987 0.2962 -0.2526 0.2213 -0.0573 -0.1175 -0.2462 -0.0736 -0.1277 0.0484 -0.1714 -0.0293 -0.0698 -0.1781 -0.2129 0.1247 0.0745 0.0863 0.1363 0.1323 0.0852 0.1021 0.0801 0.1271 0.1158 0.0851 0.0834 0.1410 0.0840 0.0683 0.1576 0.1607 0.1439 0.1452 0.1286 0.1030 0.0966 0.1055
va: 2.1062 2.2955 2.1663 2.1531 3.0042 3.2866 3.0816 3.9549 3.9098 3.8930 4.2606 4.2823 3.9337 3.4598 3.8408 3.8537 3.9721 3.8654 3.9209 3.9468 3.9029 3.9023 4.0271 3.8438 3.9460 0.9926 1.0155 1.0180 1.0269 0.9955 1.0086 1.0079 1.0049 1.0020 1.0109 1.0195 1.0156 1.0139 1.0109 1.0271 1.0082 1.0165 1.0038 1.0012 1.0055 1.0089 1.0112 1.0346
dispcorr: -0.029668741 hartree
energy: -1165.028433207325
dipole: 3.04952 -3.99057 -0.94104 -9.00917 8.61965 -0.38952 7.82590 -7.29424 0.53167
magnitude: 1.14890 au
magnitude: 2.92026 debye
