program: Orca
programVersion: 4.2.1
elementType: O O O O N N N C C C C C C C C C C C C C C C C C C H H H H H H H H H H H H H H H H H H H H H H H
charge: 0
multiplicity: 1
keywords: wb97x-d3
keywords: def2-TZVPP
keywords: def2/J RIJCOSX GRIDX6 NOFINALGRIDX
keywords: grid4 nofinalgrid
keywords: scfconv7
keywords: smallprint printgap noloewdin
keywords: NOSOSCF
formula: C18H23N3O4
InChI: InChI=1S/C18H23N3O4/c1-3-5-6-11-25-17(22)16(4-2)21(13-15-8-7-12-24-15)18(23)20-10-9-19-14-20/h3,7-10,12,14,16H,1,4-6,11,13H2,2H3
48 atoms
O  -1.043543 -1.236838 -0.696541
O  -2.980905 0.114101 1.092596
O  -1.3030 -1.166897 -2.925087
O  1.377262 0.339206 -1.28024
N  -0.488817 1.364364 -0.51582
N  1.532742 1.474018 0.684232
N  2.531823 2.83575 2.102123
C  -1.219363 0.894308 -1.688585
C  -0.850024 1.638898 -2.970301
C  -1.274994 1.783844 0.646293
C  -1.162061 -0.625789 -1.866112
C  0.815194 1.005692 -0.447896
C  -1.016729 3.144524 -2.83409
C  -1.803196 0.658504 1.459769
C  -1.053266 -2.664324 -0.606328
C  0.225891 -3.138205 0.054406
C  -1.293637 -0.010436 2.521755
C  1.449122 -3.077529 -0.8612
C  2.372361 0.695687 1.445438
C  1.689381 2.760186 1.120909
C  -2.223791 -1.049065 2.819422
C  -3.224108 -0.920161 1.917436
C  2.957395 1.555063 2.322696
C  2.716131 -3.381333 -0.127703
C  3.762386 -2.566862 -0.063815
H  -2.274358 1.111305 -1.485757
H  0.167813 1.392945 -3.271154
H  -1.498969 1.267357 -3.763551
H  -2.091349 2.408261 0.279623
H  -0.679561 2.421218 1.29239
H  -0.799868 3.639752 -3.779804
H  -2.03663 3.416213 -2.552941
H  -0.342714 3.566311 -2.08789
H  -1.185553 -3.111974 -1.592729
H  -1.916358 -2.923349 0.00924
H  0.068417 -4.168125 0.38902
H  0.395151 -2.548128 0.959609
H  -0.365005 0.206544 3.025092
H  1.529977 -2.096498 -1.328751
H  1.313488 -3.799607 -1.673717
H  2.464123 -0.367249 1.294622
H  1.184477 3.593026 0.654138
H  -2.160688 -1.781604 3.606546
H  -4.145664 -1.456172 1.761667
H  3.666864 1.322092 3.100084
H  2.762028 -4.338689 0.386088
H  4.659003 -2.834419 0.479174
H  3.763904 -1.60753 -0.568105
totalener: -1164.99556583 hartree
nucrepener: 2414.70899231 hartree
electener: -3579.70455814 hartree
oneelecener: -6385.72362713 hartree
twoeener: 2806.01906899 hartree
kineticenergy: 1160.09163887 hartree
xcener: -111.463638161626 hartree
chargesum: -0.0000000
charge: -0.258157 -0.258903 -0.349255 -0.379330 -0.102092 -0.000094 -0.293685 0.004900 -0.091177 -0.121975 0.349019 0.322439 -0.273841 0.241702 -0.066997 -0.098491 -0.263747 -0.086187 -0.146576 0.005153 -0.126090 -0.053704 -0.074067 -0.155559 -0.257956 0.088065 0.094575 0.090318 0.121471 0.140358 0.100010 0.073520 0.076978 0.122612 0.101939 0.080489 0.072892 0.146642 0.105297 0.084872 0.147588 0.147422 0.141820 0.146835 0.133567 0.102220 0.103487 0.111695
qa: -0.2582 -0.2589 -0.3493 -0.3793 -0.1021 -0.0001 -0.2937 0.0049 -0.0912 -0.1220 0.3490 0.3224 -0.2738 0.2417 -0.0670 -0.0985 -0.2637 -0.0862 -0.1466 0.0052 -0.1261 -0.0537 -0.0741 -0.1556 -0.2580 0.0881 0.0946 0.0903 0.1215 0.1404 0.1000 0.0735 0.0770 0.1226 0.1019 0.0805 0.0729 0.1466 0.1053 0.0849 0.1476 0.1474 0.1418 0.1468 0.1336 0.1022 0.1035 0.1117
va: 2.1103 2.2914 2.1680 2.1153 3.0418 3.2354 3.1470 3.9615 3.8492 3.9140 4.2437 4.2699 3.9366 3.4147 3.8670 3.8266 3.9966 3.8579 3.9140 4.0475 3.8956 3.9154 4.0411 3.7986 3.9635 1.0114 1.0226 1.0235 1.0066 0.9990 1.0090 1.0019 1.0049 1.0249 1.0006 1.0170 1.0161 1.0107 1.0251 1.0125 1.0184 0.9973 1.0028 1.0006 1.0084 1.0100 1.0116 1.0125
dispcorr: -0.030675621 hartree
energy: -1165.026241447932
dipole: 2.29944 -3.69981 -1.40037 -6.39345 6.02044 -0.37301 -4.61563 5.31189 0.69626
magnitude: 1.60778 au
magnitude: 4.08665 debye
